{"text_format":"1","workbook":"xlsx","n_sheets":10,"sheets":["Student Data Entry","CATS-NP Auto Analysis","CATS Auto Analysis","Item Analysis","Child Feedback","Adolescent Feedback","Clinician Entry & Analysis","Group Data","SS to Percentile","Data for Local Norms"],"not_rendered":{"charts":8,"images":11,"macros":1,"external_links":1,"defined_names":10,"comments":0,"pivot_tables":0},"unopened":[],"bounds":{"document_bytes":16777216,"sheet_cells":100000,"rows_first":2000,"rows_last":500,"rows_between":2000,"halvings":0,"cell_chars":16384,"cell_head_chars":4096},"cells_cut":0,"cells_raw":0,"read":"whole","date_system":"1900"}

{"sheet":"Student Data Entry","index":0,"n_rows":52,"n_cols":31,"rows_kept":52,"cut":false,"hidden":false,"merged":[[0,12,0,15],[0,26,0,28]]}
[null,"CATS-N/P Questionnaire",null,null,null,null,null,null,null,null,null,null,null,null,null,null,null,null,null,null,null,null,null,null,null,"Name: ","John Doe",null,null,"Age: ",12]
["Item #","                   \"Over the past week, I thought…\"","Not at All","Sometimes","Fairly Often","Often","All the Time"]
[1,"I enjoy life",null,null,null,null,null,null,null,{"$f":"IF(P4>1,\"ERROR\",\"\")","v":""},false,true,false,false,false,"Count","Sum",null,false,false,true,false,false,"Count","Sum"]
[2," Kids will think I’m stupid",null,null,null,null,null,null,null,{"$f":"IF(X4>1,\"ERROR\",\"\")","v":""},{"$f":"IF(K3=TRUE,0,\"\")","v":""},{"$f":"IF(L3=TRUE,1,\"\")","v":1},{"$f":"IF(M3=TRUE,2,\"\")","v":""},{"$f":"IF(N3=TRUE,3,\"\")","v":""},{"$f":"IF(O3=TRUE,4,\"\")","v":""},{"$f":"COUNT(K4:O4)","v":1},{"$f":"SUM(K4:O4)","v":1},null,{"$f":"IF(S3=TRUE,0,\"\")","v":""},{"$f":"IF(T3=TRUE,1,\"\")","v":""},{"$f":"IF(U3=TRUE,2,\"\")","v":2},{"$f":"IF(V3=TRUE,3,\"\")","v":""},{"$f":"IF(W3=TRUE,4,\"\")","v":""},{"$f":"COUNT(S4:W4)","v":1},{"$f":"SUM(S4:W4)","v":2}]
[3,"I know that everything I do will work out well",null,null,null,null,null,null,null,{"$f":"IF(P6>1,\"ERROR\",\"\")","v":""},false,false,true,false,false,"Count","Sum",null,false,true,false,false,false,"Count","Sum"]
[4," I have the right to take revenge on people if they deserve it",null,null,null,null,null,null,null,{"$f":"IF(X6>1,\"ERROR\",\"\")","v":""},{"$f":"IF(K5=TRUE,0,\"\")","v":""},{"$f":"IF(L5=TRUE,1,\"\")","v":""},{"$f":"IF(M5=TRUE,2,\"\")","v":2},{"$f":"IF(N5=TRUE,3,\"\")","v":""},{"$f":"IF(O5=TRUE,4,\"\")","v":""},{"$f":"COUNT(K6:O6)","v":1},{"$f":"SUM(K6:O6)","v":2},null,{"$f":"IF(S5=TRUE,0,\"\")","v":""},{"$f":"IF(T5=TRUE,1,\"\")","v":1},{"$f":"IF(U5=TRUE,2,\"\")","v":""},{"$f":"IF(V5=TRUE,3,\"\")","v":""},{"$f":"IF(W5=TRUE,4,\"\")","v":""},{"$f":"COUNT(S6:W6)","v":1},{"$f":"SUM(S6:W6)","v":1}]
[5,"I can’t do anything right",null,null,null,null,null,null,null,{"$f":"IF(P8>1,\"ERROR\",\"\")","v":""},false,true,false,false,false,"Count","Sum",null,false,false,true,false,false,"Count","Sum"]
[6,"I’m going to have an accident",null,null,null,null,null,null,null,{"$f":"IF(X8>1,\"ERROR\",\"\")","v":""},{"$f":"IF(K7=TRUE,0,\"\")","v":""},{"$f":"IF(L7=TRUE,1,\"\")","v":1},{"$f":"IF(M7=TRUE,2,\"\")","v":""},{"$f":"IF(N7=TRUE,3,\"\")","v":""},{"$f":"IF(O7=TRUE,4,\"\")","v":""},{"$f":"COUNT(K8:O8)","v":1},{"$f":"SUM(K8:O8)","v":1},null,{"$f":"IF(S7=TRUE,0,\"\")","v":""},{"$f":"IF(T7=TRUE,1,\"\")","v":""},{"$f":"IF(U7=TRUE,2,\"\")","v":2},{"$f":"IF(V7=TRUE,3,\"\")","v":""},{"$f":"IF(W7=TRUE,4,\"\")","v":""},{"$f":"COUNT(S8:W8)","v":1},{"$f":"SUM(S8:W8)","v":2}]
[7,"Other kids are stupid",null,null,null,null,null,null,null,{"$f":"IF(P10>1,\"ERROR\",\"\")","v":""},false,false,false,true,false,"Count","Sum",null,false,false,true,false,false,"Count","Sum"]
[8,"I’m worried that I’m going to get teased",null,null,null,null,null,null,null,{"$f":"IF(X10>1,\"ERROR\",\"\")","v":""},{"$f":"IF(K9=TRUE,0,\"\")","v":""},{"$f":"IF(L9=TRUE,1,\"\")","v":""},{"$f":"IF(M9=TRUE,2,\"\")","v":""},{"$f":"IF(N9=TRUE,3,\"\")","v":3},{"$f":"IF(O9=TRUE,4,\"\")","v":""},{"$f":"COUNT(K10:O10)","v":1},{"$f":"SUM(K10:O10)","v":3},null,{"$f":"IF(S9=TRUE,0,\"\")","v":""},{"$f":"IF(T9=TRUE,1,\"\")","v":""},{"$f":"IF(U9=TRUE,2,\"\")","v":2},{"$f":"IF(V9=TRUE,3,\"\")","v":""},{"$f":"IF(W9=TRUE,4,\"\")","v":""},{"$f":"COUNT(S10:W10)","v":1},{"$f":"SUM(S10:W10)","v":2}]
[9," I’m going crazy",null,null,null,null,null,null,null,{"$f":"IF(P12>1,\"ERROR\",\"\")","v":""},false,false,true,false,false,"Count","Sum",null,false,false,false,true,false,"Count","Sum"]
[10,"Kids are going to laugh at me",null,null,null,null,null,null,null,{"$f":"IF(X12>1,\"ERROR\",\"\")","v":""},{"$f":"IF(K11=TRUE,0,\"\")","v":""},{"$f":"IF(L11=TRUE,1,\"\")","v":""},{"$f":"IF(M11=TRUE,2,\"\")","v":2},{"$f":"IF(N11=TRUE,3,\"\")","v":""},{"$f":"IF(O11=TRUE,4,\"\")","v":""},{"$f":"COUNT(K12:O12)","v":1},{"$f":"SUM(K12:O12)","v":2},null,{"$f":"IF(S11=TRUE,0,\"\")","v":""},{"$f":"IF(T11=TRUE,1,\"\")","v":""},{"$f":"IF(U11=TRUE,2,\"\")","v":""},{"$f":"IF(V11=TRUE,3,\"\")","v":3},{"$f":"IF(W11=TRUE,4,\"\")","v":""},{"$f":"COUNT(S12:W12)","v":1},{"$f":"SUM(S12:W12)","v":3}]
[11,"I don’t give up",null,null,null,null,null,null,null,{"$f":"IF(P14>1,\"ERROR\",\"\")","v":""},true,false,false,false,false,"Count","Sum",null,true,false,false,false,false,"Count","Sum"]
[12,"I’m going to die",null,null,null,null,null,null,null,{"$f":"IF(X14>1,\"ERROR\",\"\")","v":""},{"$f":"IF(K13=TRUE,0,\"\")","v":0},{"$f":"IF(L13=TRUE,1,\"\")","v":""},{"$f":"IF(M13=TRUE,2,\"\")","v":""},{"$f":"IF(N13=TRUE,3,\"\")","v":""},{"$f":"IF(O13=TRUE,4,\"\")","v":""},{"$f":"COUNT(K14:O14)","v":1},{"$f":"SUM(K14:O14)","v":0},null,{"$f":"IF(S13=TRUE,0,\"\")","v":0},{"$f":"IF(T13=TRUE,1,\"\")","v":""},{"$f":"IF(U13=TRUE,2,\"\")","v":""},{"$f":"IF(V13=TRUE,3,\"\")","v":""},{"$f":"IF(W13=TRUE,4,\"\")","v":""},{"$f":"COUNT(S14:W14)","v":1},{"$f":"SUM(S14:W14)","v":0}]
[13,"Most people are against me",null,null,null,null,null,null,null,{"$f":"IF(P16>1,\"ERROR\",\"\")","v":""},false,true,false,false,false,"Count","Sum",null,false,false,false,true,false,"Count","Sum"]
[14,"I am worthless",null,null,null,null,null,null,null,{"$f":"IF(X16>1,\"ERROR\",\"\")","v":""},{"$f":"IF(K15=TRUE,0,\"\")","v":""},{"$f":"IF(L15=TRUE,1,\"\")","v":1},{"$f":"IF(M15=TRUE,2,\"\")","v":""},{"$f":"IF(N15=TRUE,3,\"\")","v":""},{"$f":"IF(O15=TRUE,4,\"\")","v":""},{"$f":"COUNT(K16:O16)","v":1},{"$f":"SUM(K16:O16)","v":1},null,{"$f":"IF(S15=TRUE,0,\"\")","v":""},{"$f":"IF(T15=TRUE,1,\"\")","v":""},{"$f":"IF(U15=TRUE,2,\"\")","v":""},{"$f":"IF(V15=TRUE,3,\"\")","v":3},{"$f":"IF(W15=TRUE,4,\"\")","v":""},{"$f":"COUNT(S16:W16)","v":1},{"$f":"SUM(S16:W16)","v":3}]
[15,"My mom or dad are going to get hurt",null,null,null,null,null,null,null,{"$f":"IF(P18>1,\"ERROR\",\"\")","v":""},false,false,true,false,false,"Count","Sum",null,false,true,false,false,false,"Count","Sum"]
[16,"Nothing ever works out for me anymore",null,null,null,null,null,null,null,"",{"$f":"IF(K17=TRUE,0,\"\")","v":""},{"$f":"IF(L17=TRUE,1,\"\")","v":""},{"$f":"IF(M17=TRUE,2,\"\")","v":2},{"$f":"IF(N17=TRUE,3,\"\")","v":""},{"$f":"IF(O17=TRUE,4,\"\")","v":""},{"$f":"COUNT(K18:O18)","v":1},{"$f":"SUM(K18:O18)","v":2},null,{"$f":"IF(S17=TRUE,0,\"\")","v":""},{"$f":"IF(T17=TRUE,1,\"\")","v":1},{"$f":"IF(U17=TRUE,2,\"\")","v":""},{"$f":"IF(V17=TRUE,3,\"\")","v":""},{"$f":"IF(W17=TRUE,4,\"\")","v":""},{"$f":"COUNT(S18:W18)","v":1},{"$f":"SUM(S18:W18)","v":1}]
[17,"I’m going to look silly",null,null,null,null,null,null,null,{"$f":"IF(P20>1,\"ERROR\",\"\")","v":""},true,false,false,false,false,"Count","Sum",null,true,false,false,false,false,"Count","Sum"]
[18,"I won’t let anyone get away with picking on me",null,null,null,null,null,null,null,{"$f":"IF(X20>1,\"ERROR\",\"\")","v":""},{"$f":"IF(K19=TRUE,0,\"\")","v":0},{"$f":"IF(L19=TRUE,1,\"\")","v":""},{"$f":"IF(M19=TRUE,2,\"\")","v":""},{"$f":"IF(N19=TRUE,3,\"\")","v":""},{"$f":"IF(O19=TRUE,4,\"\")","v":""},{"$f":"COUNT(K20:O20)","v":1},{"$f":"SUM(K20:O20)","v":0},null,{"$f":"IF(S19=TRUE,0,\"\")","v":0},{"$f":"IF(T19=TRUE,1,\"\")","v":""},{"$f":"IF(U19=TRUE,2,\"\")","v":""},{"$f":"IF(V19=TRUE,3,\"\")","v":""},{"$f":"IF(W19=TRUE,4,\"\")","v":""},{"$f":"COUNT(S20:W20)","v":1},{"$f":"SUM(S20:W20)","v":0}]
[19,"Other people understand me",null,null,null,null,null,null,null,{"$f":"IF(P22>1,\"ERROR\",\"\")","v":""},true,false,false,false,false,"Count","Sum",null,false,true,false,false,false,"Count","Sum"]
[20,"I’m scared of losing control",null,null,null,null,null,null,null,{"$f":"IF(X22>1,\"ERROR\",\"\")","v":""},{"$f":"IF(K21=TRUE,0,\"\")","v":0},{"$f":"IF(L21=TRUE,1,\"\")","v":""},{"$f":"IF(M21=TRUE,2,\"\")","v":""},{"$f":"IF(N21=TRUE,3,\"\")","v":""},{"$f":"IF(O21=TRUE,4,\"\")","v":""},{"$f":"COUNT(K22:O22)","v":1},{"$f":"SUM(K22:O22)","v":0},null,{"$f":"IF(S21=TRUE,0,\"\")","v":""},{"$f":"IF(T21=TRUE,1,\"\")","v":1},{"$f":"IF(U21=TRUE,2,\"\")","v":""},{"$f":"IF(V21=TRUE,3,\"\")","v":""},{"$f":"IF(W21=TRUE,4,\"\")","v":""},{"$f":"COUNT(S22:W22)","v":1},{"$f":"SUM(S22:W22)","v":1}]
[21,"Only good things will happen to me",null,null,null,null,null,null,null,{"$f":"IF(P24>1,\"ERROR\",\"\")","v":""},false,false,true,false,false,"Count","Sum",null,false,false,false,true,false,"Count","Sum"]
[22,"It’s my fault that things have gone wrong",null,null,null,null,null,null,null,{"$f":"IF(X24>1,\"ERROR\",\"\")","v":""},{"$f":"IF(K23=TRUE,0,\"\")","v":""},{"$f":"IF(L23=TRUE,1,\"\")","v":""},{"$f":"IF(M23=TRUE,2,\"\")","v":2},{"$f":"IF(N23=TRUE,3,\"\")","v":""},{"$f":"IF(O23=TRUE,4,\"\")","v":""},{"$f":"COUNT(K24:O24)","v":1},{"$f":"SUM(K24:O24)","v":2},null,{"$f":"IF(S23=TRUE,0,\"\")","v":""},{"$f":"IF(T23=TRUE,1,\"\")","v":""},{"$f":"IF(U23=TRUE,2,\"\")","v":""},{"$f":"IF(V23=TRUE,3,\"\")","v":3},{"$f":"IF(W23=TRUE,4,\"\")","v":""},{"$f":"COUNT(S24:W24)","v":1},{"$f":"SUM(S24:W24)","v":3}]
[23,"People are thinking bad things about me",null,null,null,null,null,null,null,{"$f":"IF(P26>1,\"ERROR\",\"\")","v":""},false,true,false,false,false,"Count","Sum",null,true,false,false,false,false,"Count","Sum"]
[24,"If someone hurts me, I have the right to hurt them back",null,null,null,null,null,null,null,"",{"$f":"IF(K25=TRUE,0,\"\")","v":""},{"$f":"IF(L25=TRUE,1,\"\")","v":1},{"$f":"IF(M25=TRUE,2,\"\")","v":""},{"$f":"IF(N25=TRUE,3,\"\")","v":""},{"$f":"IF(O25=TRUE,4,\"\")","v":""},{"$f":"COUNT(K26:O26)","v":1},{"$f":"SUM(K26:O26)","v":1},null,{"$f":"IF(S25=TRUE,0,\"\")","v":0},{"$f":"IF(T25=TRUE,1,\"\")","v":""},{"$f":"IF(U25=TRUE,2,\"\")","v":""},{"$f":"IF(V25=TRUE,3,\"\")","v":""},{"$f":"IF(W25=TRUE,4,\"\")","v":""},{"$f":"COUNT(S26:W26)","v":1},{"$f":"SUM(S26:W26)","v":0}]
[25,"I’m going to get hurt",null,null,null,null,null,null,null,{"$f":"IF(P28>1,\"ERROR\",\"\")","v":""},false,true,false,false,false,"Count","Sum",null,false,true,false,false,false,"Count","Sum"]
[26,"I’m afraid of what other kids will think of me",null,null,null,null,null,null,null,"",{"$f":"IF(K27=TRUE,0,\"\")","v":""},{"$f":"IF(L27=TRUE,1,\"\")","v":1},{"$f":"IF(M27=TRUE,2,\"\")","v":""},{"$f":"IF(N27=TRUE,3,\"\")","v":""},{"$f":"IF(O27=TRUE,4,\"\")","v":""},{"$f":"COUNT(K28:O28)","v":1},{"$f":"SUM(K28:O28)","v":1},null,{"$f":"IF(S27=TRUE,0,\"\")","v":""},{"$f":"IF(T27=TRUE,1,\"\")","v":1},{"$f":"IF(U27=TRUE,2,\"\")","v":""},{"$f":"IF(V27=TRUE,3,\"\")","v":""},{"$f":"IF(W27=TRUE,4,\"\")","v":""},{"$f":"COUNT(S28:W28)","v":1},{"$f":"SUM(S28:W28)","v":1}]
[27,"Some people deserve what they get",null,null,null,null,null,null,null,{"$f":"IF(P30>1,\"ERROR\",\"\")","v":""},false,false,true,false,false,"Count","Sum",null,false,false,true,false,false,"Count","Sum"]
[28,"I feel good about myself",null,null,null,null,null,null,null,"",{"$f":"IF(K29=TRUE,0,\"\")","v":""},{"$f":"IF(L29=TRUE,1,\"\")","v":""},{"$f":"IF(M29=TRUE,2,\"\")","v":2},{"$f":"IF(N29=TRUE,3,\"\")","v":""},{"$f":"IF(O29=TRUE,4,\"\")","v":""},{"$f":"COUNT(K30:O30)","v":1},{"$f":"SUM(K30:O30)","v":2},null,{"$f":"IF(S29=TRUE,0,\"\")","v":""},{"$f":"IF(T29=TRUE,1,\"\")","v":""},{"$f":"IF(U29=TRUE,2,\"\")","v":2},{"$f":"IF(V29=TRUE,3,\"\")","v":""},{"$f":"IF(W29=TRUE,4,\"\")","v":""},{"$f":"COUNT(S30:W30)","v":1},{"$f":"SUM(S30:W30)","v":2}]
[29,"I’ve made such a mess of my life",null,null,null,null,null,null,null,{"$f":"IF(P32>1,\"ERROR\",\"\")","v":""},false,true,false,false,false,"Count","Sum",null,false,false,false,true,false,"Count","Sum"]
[30,"Something awful is going to happen",null,null,null,null,null,null,null,"",{"$f":"IF(K31=TRUE,0,\"\")","v":""},{"$f":"IF(L31=TRUE,1,\"\")","v":1},{"$f":"IF(M31=TRUE,2,\"\")","v":""},{"$f":"IF(N31=TRUE,3,\"\")","v":""},{"$f":"IF(O31=TRUE,4,\"\")","v":""},{"$f":"COUNT(K32:O32)","v":1},{"$f":"SUM(K32:O32)","v":1},null,{"$f":"IF(S31=TRUE,0,\"\")","v":""},{"$f":"IF(T31=TRUE,1,\"\")","v":""},{"$f":"IF(U31=TRUE,2,\"\")","v":""},{"$f":"IF(V31=TRUE,3,\"\")","v":3},{"$f":"IF(W31=TRUE,4,\"\")","v":""},{"$f":"COUNT(S32:W32)","v":1},{"$f":"SUM(S32:W32)","v":3}]
[31,"I look like an idiot",null,null,null,null,null,null,null,{"$f":"IF(P34>1,\"ERROR\",\"\")","v":""},true,false,false,false,false,"Count","Sum",null,true,false,false,false,false,"Count","Sum"]
[32,"My future looks bright",null,null,null,null,null,null,null,"",{"$f":"IF(K33=TRUE,0,\"\")","v":0},{"$f":"IF(L33=TRUE,1,\"\")","v":""},{"$f":"IF(M33=TRUE,2,\"\")","v":""},{"$f":"IF(N33=TRUE,3,\"\")","v":""},{"$f":"IF(O33=TRUE,4,\"\")","v":""},{"$f":"COUNT(K34:O34)","v":1},{"$f":"SUM(K34:O34)","v":0},null,{"$f":"IF(S33=TRUE,0,\"\")","v":0},{"$f":"IF(T33=TRUE,1,\"\")","v":""},{"$f":"IF(U33=TRUE,2,\"\")","v":""},{"$f":"IF(V33=TRUE,3,\"\")","v":""},{"$f":"IF(W33=TRUE,4,\"\")","v":""},{"$f":"COUNT(S34:W34)","v":1},{"$f":"SUM(S34:W34)","v":0}]
[33,"I’ll never be as good as other people are",null,null,null,null,null,null,null,{"$f":"IF(P36>1,\"ERROR\",\"\")","v":""},false,false,false,false,false,"Count","Sum",null,false,true,false,false,false,"Count","Sum"]
[34,"I always get blamed for things that are not my fault",null,null,null,null,null,null,null,"",{"$f":"IF(K35=TRUE,0,\"\")","v":""},{"$f":"IF(L35=TRUE,1,\"\")","v":""},{"$f":"IF(M35=TRUE,2,\"\")","v":""},{"$f":"IF(N35=TRUE,3,\"\")","v":""},{"$f":"IF(O35=TRUE,4,\"\")","v":""},{"$f":"COUNT(K36:O36)","v":0},{"$f":"SUM(K36:O36)","v":0},null,{"$f":"IF(S35=TRUE,0,\"\")","v":""},{"$f":"IF(T35=TRUE,1,\"\")","v":1},{"$f":"IF(U35=TRUE,2,\"\")","v":""},{"$f":"IF(V35=TRUE,3,\"\")","v":""},{"$f":"IF(W35=TRUE,4,\"\")","v":""},{"$f":"COUNT(S36:W36)","v":1},{"$f":"SUM(S36:W36)","v":1}]
[35,"I am a failure",null,null,null,null,null,null,null,{"$f":"IF(P38>1,\"ERROR\",\"\")","v":""},false,true,false,false,false,"Count","Sum",null,false,false,false,true,false,"Count","Sum"]
[36,"Other kids are making fun of me",null,null,null,null,null,null,null,"",{"$f":"IF(K37=TRUE,0,\"\")","v":""},{"$f":"IF(L37=TRUE,1,\"\")","v":1},{"$f":"IF(M37=TRUE,2,\"\")","v":""},{"$f":"IF(N37=TRUE,3,\"\")","v":""},{"$f":"IF(O37=TRUE,4,\"\")","v":""},{"$f":"COUNT(K38:O38)","v":1},{"$f":"SUM(K38:O38)","v":1},null,{"$f":"IF(S37=TRUE,0,\"\")","v":""},{"$f":"IF(T37=TRUE,1,\"\")","v":""},{"$f":"IF(U37=TRUE,2,\"\")","v":""},{"$f":"IF(V37=TRUE,3,\"\")","v":3},{"$f":"IF(W37=TRUE,4,\"\")","v":""},{"$f":"COUNT(S38:W38)","v":1},{"$f":"SUM(S38:W38)","v":3}]
[37,"Everything will turn out well",null,null,null,null,null,null,null,{"$f":"IF(P40>1,\"ERROR\",\"\")","v":""},false,false,true,false,false,"Count","Sum",null,false,true,false,false,false,"Count","Sum"]
[38,"Life is not worth living",null,null,null,null,null,null,null,"",{"$f":"IF(K39=TRUE,0,\"\")","v":""},{"$f":"IF(L39=TRUE,1,\"\")","v":""},{"$f":"IF(M39=TRUE,2,\"\")","v":2},{"$f":"IF(N39=TRUE,3,\"\")","v":""},{"$f":"IF(O39=TRUE,4,\"\")","v":""},{"$f":"COUNT(K40:O40)","v":1},{"$f":"SUM(K40:O40)","v":2},null,{"$f":"IF(S39=TRUE,0,\"\")","v":""},{"$f":"IF(T39=TRUE,1,\"\")","v":1},{"$f":"IF(U39=TRUE,2,\"\")","v":""},{"$f":"IF(V39=TRUE,3,\"\")","v":""},{"$f":"IF(W39=TRUE,4,\"\")","v":""},{"$f":"COUNT(S40:W40)","v":1},{"$f":"SUM(S40:W40)","v":1}]
[39,"Everyone is staring at me",null,null,null,null,null,null,null,{"$f":"IF(P42>1,\"ERROR\",\"\")","v":""},false,false,true,false,false,"Count","Sum",null,false,false,false,true,false,"Count","Sum"]
[40,"Kids my age like me",null,null,null,null,null,null,null,"",{"$f":"IF(K41=TRUE,0,\"\")","v":""},{"$f":"IF(L41=TRUE,1,\"\")","v":""},{"$f":"IF(M41=TRUE,2,\"\")","v":2},{"$f":"IF(N41=TRUE,3,\"\")","v":""},{"$f":"IF(O41=TRUE,4,\"\")","v":""},{"$f":"COUNT(K42:O42)","v":1},{"$f":"SUM(K42:O42)","v":2},null,{"$f":"IF(S41=TRUE,0,\"\")","v":""},{"$f":"IF(T41=TRUE,1,\"\")","v":""},{"$f":"IF(U41=TRUE,2,\"\")","v":""},{"$f":"IF(V41=TRUE,3,\"\")","v":3},{"$f":"IF(W41=TRUE,4,\"\")","v":""},{"$f":"COUNT(S42:W42)","v":1},{"$f":"SUM(S42:W42)","v":3}]
[41,"I’m afraid I will make a fool of myself",null,null,null,null,null,null,null,{"$f":"IF(P44>1,\"ERROR\",\"\")","v":""},false,false,true,false,false,"Count","Sum",null,false,false,true,false,false,"Count","Sum"]
[42,"I’m scared that somebody might die",null,null,null,null,null,null,null,"",{"$f":"IF(K43=TRUE,0,\"\")","v":""},{"$f":"IF(L43=TRUE,1,\"\")","v":""},{"$f":"IF(M43=TRUE,2,\"\")","v":2},{"$f":"IF(N43=TRUE,3,\"\")","v":""},{"$f":"IF(O43=TRUE,4,\"\")","v":""},{"$f":"COUNT(K44:O44)","v":1},{"$f":"SUM(K44:O44)","v":2},null,{"$f":"IF(S43=TRUE,0,\"\")","v":""},{"$f":"IF(T43=TRUE,1,\"\")","v":""},{"$f":"IF(U43=TRUE,2,\"\")","v":2},{"$f":"IF(V43=TRUE,3,\"\")","v":""},{"$f":"IF(W43=TRUE,4,\"\")","v":""},{"$f":"COUNT(S44:W44)","v":1},{"$f":"SUM(S44:W44)","v":2}]
[43,"I will never overcome my problems",null,null,null,null,null,null,null,{"$f":"IF(P46>1,\"ERROR\",\"\")","v":""},true,false,false,false,false,"Count","Sum",null,false,false,true,false,false,"Count","Sum"]
[44,"People always try to get me into trouble",null,null,null,null,null,null,null,"",{"$f":"IF(K45=TRUE,0,\"\")","v":0},{"$f":"IF(L45=TRUE,1,\"\")","v":""},{"$f":"IF(M45=TRUE,2,\"\")","v":""},{"$f":"IF(N45=TRUE,3,\"\")","v":""},{"$f":"IF(O45=TRUE,4,\"\")","v":""},{"$f":"COUNT(K46:O46)","v":1},{"$f":"SUM(K46:O46)","v":0},null,{"$f":"IF(S45=TRUE,0,\"\")","v":""},{"$f":"IF(T45=TRUE,1,\"\")","v":""},{"$f":"IF(U45=TRUE,2,\"\")","v":2},{"$f":"IF(V45=TRUE,3,\"\")","v":""},{"$f":"IF(W45=TRUE,4,\"\")","v":""},{"$f":"COUNT(S46:W46)","v":1},{"$f":"SUM(S46:W46)","v":2}]
[45,"I feel great",null,null,null,null,null,null,null,{"$f":"IF(P48>1,\"ERROR\",\"\")","v":""},false,false,false,true,false,"Count","Sum",null,false,false,false,false,true,"Count","Sum"]
[46,"There is something very wrong with me",null,null,null,null,null,null,null,"",{"$f":"IF(K47=TRUE,0,\"\")","v":""},{"$f":"IF(L47=TRUE,1,\"\")","v":""},{"$f":"IF(M47=TRUE,2,\"\")","v":""},{"$f":"IF(N47=TRUE,3,\"\")","v":3},{"$f":"IF(O47=TRUE,4,\"\")","v":""},{"$f":"COUNT(K48:O48)","v":1},{"$f":"SUM(K48:O48)","v":3},null,{"$f":"IF(S47=TRUE,0,\"\")","v":""},{"$f":"IF(T47=TRUE,1,\"\")","v":""},{"$f":"IF(U47=TRUE,2,\"\")","v":""},{"$f":"IF(V47=TRUE,3,\"\")","v":""},{"$f":"IF(W47=TRUE,4,\"\")","v":4},{"$f":"COUNT(S48:W48)","v":1},{"$f":"SUM(S48:W48)","v":4}]
[47,"Some people are bad",null,null,null,null,null,null,null,{"$f":"IF(P50>1,\"ERROR\",\"\")","v":""},true,false,false,false,false,"Count","Sum",null,true,false,false,false,false,"Count","Sum"]
[48,"I hate myself",null,null,null,null,null,null,null,"",{"$f":"IF(K49=TRUE,0,\"\")","v":0},{"$f":"IF(L49=TRUE,1,\"\")","v":""},{"$f":"IF(M49=TRUE,2,\"\")","v":""},{"$f":"IF(N49=TRUE,3,\"\")","v":""},{"$f":"IF(O49=TRUE,4,\"\")","v":""},{"$f":"COUNT(K50:O50)","v":1},{"$f":"SUM(K50:O50)","v":0},null,{"$f":"IF(S49=TRUE,0,\"\")","v":0},{"$f":"IF(T49=TRUE,1,\"\")","v":""},{"$f":"IF(U49=TRUE,2,\"\")","v":""},{"$f":"IF(V49=TRUE,3,\"\")","v":""},{"$f":"IF(W49=TRUE,4,\"\")","v":""},{"$f":"COUNT(S50:W50)","v":1},{"$f":"SUM(S50:W50)","v":0}]
[49,"Something will happen to someone I care about",null,null,null,null,null,null,null,{"$f":"IF(P52>1,\"ERROR\",\"\")","v":""},false,false,true,false,false,"Count","Sum",null,true,false,false,false,false,"Count","Sum"]
[50,"Bad people deserve to get punished",null,null,null,null,null,null,null,"",{"$f":"IF(K51=TRUE,0,\"\")","v":""},{"$f":"IF(L51=TRUE,1,\"\")","v":""},{"$f":"IF(M51=TRUE,2,\"\")","v":2},{"$f":"IF(N51=TRUE,3,\"\")","v":""},{"$f":"IF(O51=TRUE,4,\"\")","v":""},{"$f":"COUNT(K52:O52)","v":1},{"$f":"SUM(K52:O52)","v":2},null,{"$f":"IF(S51=TRUE,0,\"\")","v":0},{"$f":"IF(T51=TRUE,1,\"\")","v":""},{"$f":"IF(U51=TRUE,2,\"\")","v":""},{"$f":"IF(V51=TRUE,3,\"\")","v":""},{"$f":"IF(W51=TRUE,4,\"\")","v":""},{"$f":"COUNT(S52:W52)","v":1},{"$f":"SUM(S52:W52)","v":0}]

{"sheet":"CATS-NP Auto Analysis","index":1,"n_rows":52,"n_cols":22,"rows_kept":52,"cut":false,"hidden":false,"merged":[[0,0,0,2],[0,5,0,9],[1,12,1,13]]}
["Children's Automatic Thoughts Scale - Negative & Positive (CATS-N/P)",null,null,null,null,"CATS-N/P Scale Totals"]
["#","Questionnaire Item","Rating",null,null,"Physical Threat","Social Threat","Failure","Hostility","Positive Thoughts",null,"Name: ",{"$f":"'Student Data Entry'!$AA$1","v":"John Doe"},null,"Age: ",{"$f":"'Student Data Entry'!$AE$1","v":12}]
[1,"I enjoy life",{"$f":"'Student Data Entry'!$Q$4","v":1},{"$f":"IF(C3>4,\"Invalid Rating\",\"\")","v":""},"Raw Scores",{"$f":"SUM(C8,C11,C14,C17,C22,C27,C32,C44,C48,C51)","v":19},{"$f":"SUM(C4,C10,C12,C19,C25,C28,C33,C38,C41,C43)","v":16},{"$f":"SUM(C7,C16,C18,C24,C31,C35,C37,C40,C45,C50)","v":11},{"$f":"SUM(C6,C9,C15,C20,C26,C29,C36,C46,C49,C52)","v":10},{"$f":"SUM(C3,C5,C13,C21,C23,C30,C34,C39,C42,C47)","v":15},null,null,null,null,null,null,"Physical Threat","Social Threat","Failure","Hostility","Positive Thoughts"]
[2," Kids will think I’m stupid",{"$f":"'Student Data Entry'!$Y$4","v":2},{"$f":"IF(C4>4,\"Invalid Rating\",\"\")","v":""},"Sample Means",6.43,8.65,7.3,11.87,21.67,"Ages 8 - 11",null,null,null,null,null,{"$f":"$F$3","v":19},{"$f":"$G$3","v":16},{"$f":"$H$3","v":11},{"$f":"$I$3","v":10},{"$f":"$J$3","v":15},"Raw Scores"]
[3,"I know that everything I do will work out well",{"$f":"'Student Data Entry'!$Q$6","v":2},"","Norm SDs",5.76,6.69,6.18,6.87,7.94,null,null,null,null,null,null,{"$f":"IF(Q4=0,\"\",(Q4-F4)/F5)","v":2.182291666666667},{"$f":"IF(R4=0,\"\",(R4-G4)/G5)","v":1.0986547085201792},{"$f":"IF(S4=0,\"\",(S4-H4)/H5)","v":0.59870550161812308},{"$f":"IF(T4=0,\"\",(T4-I4)/I5)","v":-0.27219796215429393},{"$f":"IF(U4=0,\"\",(U4-J4)/J5)","v":-0.84005037783375336},"Ages 8 - 11"]
[4," I have the right to take revenge on people if they deserve it",{"$f":"'Student Data Entry'!$Y$6","v":1},"","Sig.Cut-off",{"$f":"SUM(F4,F5)+(F5/2)","v":15.07},{"$f":"SUM(G4,G5)+(G5/2)","v":18.684999999999999},16.57,22.174999999999997,{"$f":"(J4-J5)-(J5/2)","v":9.76},null,null,null,null,null,null,{"$f":"100+Q5*(15)","v":132.734375},{"$f":"100+R5*(15)","v":116.4798206278027},108.98058252427185,95.917030567685586,87.399244332493694,"Standard Score"]
[5,"I can’t do anything right",{"$f":"'Student Data Entry'!$Q$8","v":1},"",null,{"$f":"IF(F3>15.07,\"Significant\",\"\")","v":"Significant"},{"$f":"IF(G3>18.69,\"Significant\",\"\")","v":""},{"$f":"IF(H3>16.57,\"Significant\",\"\")","v":""},{"$f":"IF(I3>22.18,\"Significant\",\"\")","v":""},{"$f":"IF(AND(J3>0,J3<9.76),\"Significant\",\"\")","v":""},null,null,null,null,null,null,{"$f":"10*Q5+50","v":71.822916666666671},{"$f":"10*R5+50","v":60.986547085201792},55.98705501618123,47.278020378457057,41.599496221662463,"T-Score"]
[6,"I’m going to have an accident",{"$f":"'Student Data Entry'!$Y$8","v":2},"","z-scores",{"$f":"IF(F3=0,\"\",(F3-6.43)/5.76)","v":2.182291666666667},{"$f":"IF(G3=0,\"\",(G3-8.65)/6.69)","v":1.0986547085201792},{"$f":"IF(H3=0,\"\",(H3-7.3)/6.18)","v":0.59870550161812308},{"$f":"IF(I3=0,\"\",(I3-11.87)/6.87)","v":-0.27219796215429393},{"$f":"IF(J3=0,\"\",(J3-21.67)/7.94)","v":-0.84005037783375336},null,null,null,null,null,null,{"$f":"NORMSDIST(F8)*100","v":98.545599317615853},{"$f":"NORMSDIST(G8)*100","v":86.404064750851262},72.531535609990058,39.273490433425764,20.044007044538176,"Percentile Rank"]
[7,"Other kids are stupid",{"$f":"'Student Data Entry'!$Q$10","v":3},"","Sample Means",4.63,6.32,4.49,11.25,22.3,"Ages 12 - 18",null,null,null,null,null,{"$f":"IF(ISBLANK(Q6),\"\",IF(AND(Q6>49,Q6<70),\"Extremely Below Ave.\",IF(AND(Q6>69,Q6<80),\"Well-Below Average\",IF(AND(Q6>79,Q6<90),\"Below Average\",IF(AND(Q6>89,Q6<110),\"Average\",IF(AND(Q6>109,Q6<120),\"Above Average\",IF(AND(Q6>119,Q6<130),\"Well-Above Average\",IF(AND(Q6>129,Q6<150),\"Extremely Above Ave.\",\"\"))))))))","v":"Extremely Above Ave."},{"$f":"IF(ISBLANK(R6),\"\",IF(AND(R6>49,R6<70),\"Extremely Below Ave.\",IF(AND(R6>69,R6<80),\"Well-Below Average\",IF(AND(R6>79,R6<90),\"Below Average\",IF(AND(R6>89,R6<110),\"Average\",IF(AND(R6>109,R6<120),\"Above Average\",IF(AND(R6>119,R6<130),\"Well-Above Average\",IF(AND(R6>129,R6<150),\"Extremely Above Ave.\",\"\"))))))))","v":"Above Average"},{"$f":"IF(ISBLANK(S6),\"\",IF(AND(S6>49,S6<70),\"Extremely Below Ave.\",IF(AND(S6>69,S6<80),\"Well-Below Average\",IF(AND(S6>79,S6<90),\"Below Average\",IF(AND(S6>89,S6<110),\"Average\",IF(AND(S6>109,S6<120),\"Above Average\",IF(AND(S6>119,S6<130),\"Well-Above Average\",IF(AND(S6>129,S6<150),\"Extremely Above Ave.\",\"\"))))))))","v":"Average"},{"$f":"IF(ISBLANK(T6),\"\",IF(AND(T6>49,T6<70),\"Extremely Below Ave.\",IF(AND(T6>69,T6<80),\"Well-Below Average\",IF(AND(T6>79,T6<90),\"Below Average\",IF(AND(T6>89,T6<110),\"Average\",IF(AND(T6>109,T6<120),\"Above Average\",IF(AND(T6>119,T6<130),\"Well-Above Average\",IF(AND(T6>129,T6<150),\"Extremely Above Ave.\",\"\"))))))))","v":"Average"},{"$f":"IF(ISBLANK(U6),\"\",IF(AND(U6>49,U6<70),\"Extremely Below Ave.\",IF(AND(U6>69,U6<80),\"Well-Below Average\",IF(AND(U6>79,U6<90),\"Below Average\",IF(AND(U6>89,U6<110),\"Average\",IF(AND(U6>109,U6<120),\"Above Average\",IF(AND(U6>119,U6<130),\"Well-Above Average\",IF(AND(U6>129,U6<150),\"Extremely Above Ave.\",\"\"))))))))","v":"Below Average"},"Classification"]
[8,"I’m worried that I’m going to get teased",{"$f":"'Student Data Entry'!$Y$10","v":2},"","Norm SDs",5.61,6.69,5.94,7.66,8.2200000000000006,null,null,null,null,null,null,{"$f":"IF(Q4=0,\"\",(Q4-F9)/F10)","v":2.5614973262032086},{"$f":"IF(R4=0,\"\",(R4-G9)/G10)","v":1.4469357249626307},{"$f":"IF(S4=0,\"\",(S4-H9)/H10)","v":1.0959595959595958},{"$f":"IF(T4=0,\"\",(T4-I9)/I10)","v":-0.16318537859007834},{"$f":"IF(U4=0,\"\",(U4-J9)/J10)","v":-0.88807785888077861},"Ages 12 - 18"]
[9," I’m going crazy",{"$f":"'Student Data Entry'!$Q$12","v":2},"","Sig.Cut-off",{"$f":"SUM(F9,F10)+(F10/2)","v":13.045},{"$f":"SUM(G9,G10)+(G10/2)","v":16.355},{"$f":"SUM(H9,H10)+(H10/2)","v":13.4},{"$f":"SUM(I9,I10)+(I10/2)","v":22.740000000000002},{"$f":"(J9-J10)-(J10/2)","v":9.9699999999999989},null,null,null,null,null,null,{"$f":"100+Q10*(15)","v":138.42245989304814},{"$f":"100+R10*(15)","v":121.70403587443946},116.43939393939394,97.552219321148826,86.678832116788328,"Standard Score"]
[10,"Kids are going to laugh at me",{"$f":"'Student Data Entry'!$Y$12","v":3},"",null,{"$f":"IF(F3>13.05,\"Significant\",\"\")","v":"Significant"},{"$f":"IF(G3>16.36,\"Significant\",\"\")","v":""},{"$f":"IF(H3>13.4,\"Significant\",\"\")","v":""},{"$f":"IF(I3>22.74,\"Significant\",\"\")","v":""},{"$f":"IF(AND(J3>0,J3<9.97),\"Significant\",\"\")","v":""},null,null,null,null,null,null,{"$f":"10*Q10+50","v":75.614973262032095},{"$f":"10*R10+50","v":64.469357249626313},60.959595959595958,48.36814621409922,41.119221411192214,"T-Score"]
[11,"I don’t give up",{"$f":"'Student Data Entry'!$Q$14","v":0},"","z-scores",{"$f":"IF(F3=0,\"\",(F3-4.63)/5.61)","v":2.5614973262032086},{"$f":"IF(G3=0,\"\",(G3-6.32)/6.69)","v":1.4469357249626307},{"$f":"IF(H3=0,\"\",(H3-4.49)/5.94)","v":1.0959595959595958},{"$f":"IF(I3=0,\"\",(I3-11.25)/7.66)","v":-0.16318537859007834},{"$f":"IF(J3=0,\"\",(J3-22.3)/9.97)","v":-0.7321965897693079},null,null,null,null,null,null,{"$f":"NORMSDIST(F13)*100","v":99.478889782413631},{"$f":"NORMSDIST(G13)*100","v":92.604253686329187},{"$f":"NORMSDIST(H13)*100","v":86.345177171513029},{"$f":"NORMSDIST(I13)*100","v":43.518623904402595},{"$f":"NORMSDIST(J13)*100","v":23.20242927592539},"Percentile Rank"]
[12,"I’m going to die",{"$f":"'Student Data Entry'!$Y$14","v":0},"",null,null,null,null,null,null,null,null,null,null,null,null,{"$f":"IF(ISBLANK(Q11),\"\",IF(AND(Q11>49,Q11<70),\"Extremely Below Ave.\",IF(AND(Q11>69,Q11<80),\"Well-Below Average\",IF(AND(Q11>79,Q11<90),\"Below Average\",IF(AND(Q11>89,Q11<110),\"Average\",IF(AND(Q11>109,Q11<120),\"Above Average\",IF(AND(Q11>119,Q11<130),\"Well-Above Average\",IF(AND(Q11>129,Q11<150),\"Extremely Above Ave.\",\"\"))))))))","v":"Extremely Above Ave."},{"$f":"IF(ISBLANK(R11),\"\",IF(AND(R11>49,R11<70),\"Extremely Below Ave.\",IF(AND(R11>69,R11<80),\"Well-Below Average\",IF(AND(R11>79,R11<90),\"Below Average\",IF(AND(R11>89,R11<110),\"Average\",IF(AND(R11>109,R11<120),\"Above Average\",IF(AND(R11>119,R11<130),\"Well-Above Average\",IF(AND(R11>129,R11<150),\"Extremely Above Ave.\",\"\"))))))))","v":"Well-Above Average"},{"$f":"IF(ISBLANK(S11),\"\",IF(AND(S11>49,S11<70),\"Extremely Below Ave.\",IF(AND(S11>69,S11<80),\"Well-Below Average\",IF(AND(S11>79,S11<90),\"Below Average\",IF(AND(S11>89,S11<110),\"Average\",IF(AND(S11>109,S11<120),\"Above Average\",IF(AND(S11>119,S11<130),\"Well-Above Average\",IF(AND(S11>129,S11<150),\"Extremely Above Ave.\",\"\"))))))))","v":"Above Average"},{"$f":"IF(ISBLANK(T11),\"\",IF(AND(T11>49,T11<70),\"Extremely Below Ave.\",IF(AND(T11>69,T11<80),\"Well-Below Average\",IF(AND(T11>79,T11<90),\"Below Average\",IF(AND(T11>89,T11<110),\"Average\",IF(AND(T11>109,T11<120),\"Above Average\",IF(AND(T11>119,T11<130),\"Well-Above Average\",IF(AND(T11>129,T11<150),\"Extremely Above Ave.\",\"\"))))))))","v":"Average"},{"$f":"IF(ISBLANK(U11),\"\",IF(AND(U11>49,U11<70),\"Extremely Below Ave.\",IF(AND(U11>69,U11<80),\"Well-Below Average\",IF(AND(U11>79,U11<90),\"Below Average\",IF(AND(U11>89,U11<110),\"Average\",IF(AND(U11>109,U11<120),\"Above Average\",IF(AND(U11>119,U11<130),\"Well-Above Average\",IF(AND(U11>129,U11<150),\"Extremely Above Ave.\",\"\"))))))))","v":"Below Average"},"Classification"]
[13,"Most people are against me",{"$f":"'Student Data Entry'!$Q$16","v":1},""]
[14,"I am worthless",{"$f":"'Student Data Entry'!$Y$16","v":3},""]
[15,"My mom or dad are going to get hurt",{"$f":"'Student Data Entry'!$Q$18","v":2},""]
[16,"Nothing ever works out for me anymore",{"$f":"'Student Data Entry'!$Y$18","v":1},""]
[17,"I’m going to look silly",{"$f":"'Student Data Entry'!$Q$20","v":0},""]
[18,"I won’t let anyone get away with picking on me",{"$f":"'Student Data Entry'!$Y$20","v":0},""]
[19,"Other people understand me",{"$f":"'Student Data Entry'!$Q$22","v":0},""]
[20,"I’m scared of losing control",{"$f":"'Student Data Entry'!$Y$22","v":1},""]
[21,"Only good things will happen to me",{"$f":"'Student Data Entry'!$Q$24","v":2},""]
[22,"It’s my fault that things have gone wrong",{"$f":"'Student Data Entry'!$Y$24","v":3},""]
[23,"People are thinking bad things about me",{"$f":"'Student Data Entry'!$Q$26","v":1},""]
[24,"If someone hurts me, I have the right to hurt them back",{"$f":"'Student Data Entry'!$Y$26","v":0},""]
[25,"I’m going to get hurt",{"$f":"'Student Data Entry'!$Q$28","v":1},""]
[26,"I’m afraid of what other kids will think of me",{"$f":"'Student Data Entry'!$Y$28","v":1},""]
[27,"Some people deserve what they get",{"$f":"'Student Data Entry'!$Q$30","v":2},""]
[28,"I feel good about myself",{"$f":"'Student Data Entry'!$Y$30","v":2},""]
[29,"I’ve made such a mess of my life",{"$f":"'Student Data Entry'!$Q$32","v":1},""]
[30,"Something awful is going to happen",{"$f":"'Student Data Entry'!$Y$32","v":3},""]
[31,"I look like an idiot",{"$f":"'Student Data Entry'!$Q$34","v":0},""]
[32,"My future looks bright",{"$f":"'Student Data Entry'!$Y$34","v":0},""]
[33,"I’ll never be as good as other people are",{"$f":"'Student Data Entry'!$Q$36","v":0},""]
[34,"I always get blamed for things that are not my fault",{"$f":"'Student Data Entry'!$Y$36","v":1},""]
[35,"I am a failure",{"$f":"'Student Data Entry'!$Q$38","v":1},""]
[36,"Other kids are making fun of me",{"$f":"'Student Data Entry'!$Y$38","v":3},{"$f":"IF(C38>4,\"Invalid Rating\",\"\")","v":""}]
[37,"Everything will turn out well",{"$f":"'Student Data Entry'!$Q$40","v":2},""]
[38,"Life is not worth living",{"$f":"'Student Data Entry'!$Y$40","v":1},""]
[39,"Everyone is staring at me",{"$f":"'Student Data Entry'!$Q$42","v":2},""]
[40,"Kids my age like me",{"$f":"'Student Data Entry'!$Y$42","v":3},""]
[41,"I’m afraid I will make a fool of myself",{"$f":"'Student Data Entry'!$Q$44","v":2},""]
[42,"I’m scared that somebody might die",{"$f":"'Student Data Entry'!$Y$44","v":2},""]
[43,"I will never overcome my problems",{"$f":"'Student Data Entry'!$Q$46","v":0},""]
[44,"People always try to get me into trouble",{"$f":"'Student Data Entry'!$Y$46","v":2},""]
[45,"I feel great",{"$f":"'Student Data Entry'!$Q$48","v":3},""]
[46,"There is something very wrong with me",{"$f":"'Student Data Entry'!$Y$48","v":4},""]
[47,"Some people are bad",{"$f":"'Student Data Entry'!$Q$50","v":0},""]
[48,"I hate myself",{"$f":"'Student Data Entry'!$Y$50","v":0},""]
[49,"Something will happen to someone I care about",{"$f":"'Student Data Entry'!$Q$52","v":2},""]
[50,"Bad people deserve to get punished",{"$f":"'Student Data Entry'!$Y$52","v":0},""]

{"sheet":"CATS Auto Analysis","index":2,"n_rows":47,"n_cols":16,"rows_kept":47,"cut":false,"hidden":false,"merged":[[0,5,0,8],[27,11,27,12]]}
[null,null,null,null,null,"CATS Normative Analysis"]
[null,null,null,null,null,"Physical Threat","Social Threat","Failure","Hostility"]
[null,null,null,null,null,{"$f":"'CATS-NP Auto Analysis'!F3","v":19},{"$f":"'CATS-NP Auto Analysis'!G3","v":16},{"$f":"'CATS-NP Auto Analysis'!H3","v":11},{"$f":"'CATS-NP Auto Analysis'!I3","v":10}]
[null,null,null,null,null,8.17,10.19,8.6300000000000008,13.58,"Ages 7-11"]
[null,null,null,null,null,8.16,9.99,9.8800000000000008,9.66]
[null,null,null,null,null,{"$f":"SUM(F4,F5)+(F5/2)","v":20.409999999999997},{"$f":"SUM(G4,G5)+(G5/2)","v":25.175000000000001},23.450000000000003,28.07]
[null,null,null,null,null,{"$f":"IF(F3>20.41,\"Significant\",\"\")","v":""},{"$f":"IF(G3>25.175,\"Significant\",\"\")","v":""},{"$f":"IF(H3>23.45,\"Significant\",\"\")","v":""},{"$f":"IF(I3>28.07,\"Significant\",\"\")","v":""}]
[null,null,null,null,null,7.02,9.49,7.59,13.68,"Ages 12-16"]
[null,null,null,null,null,6.87,7.1,7.99,8.0399999999999991]
[null,null,null,null,null,{"$f":"SUM(F8,F9)+(F9/2)","v":17.324999999999999},{"$f":"SUM(G8,G9)+(G9/2)","v":20.14},{"$f":"SUM(H8,H9)+(H9/2)","v":19.574999999999999},{"$f":"SUM(I8,I9)+(I9/2)","v":25.74}]
[null,null,null,null,null,{"$f":"IF(F3>17.325,\"Significant\",\"\")","v":"Significant"},{"$f":"IF(G3>20.14,\"Significant\",\"\")","v":""},{"$f":"IF(H3>19.575,\"Significant\",\"\")","v":""},{"$f":"IF(I3>22.74,\"Significant\",\"\")","v":""}]
[]
[]
[]
[null,null,null,null,null,null,null,null,null,null,null,"Physical Threat","Social Threat","Failure","Hostility"]
[null,null,null,null,null,null,null,null,null,null,null,{"$f":"$F$3","v":19},{"$f":"$G$3","v":16},{"$f":"$H$3","v":11},{"$f":"$I$3","v":10},"Raw Scores"]
[null,null,null,null,null,null,null,null,null,null,null,{"$f":"IF(L16=0,\"\",(L16-F4)/F5)","v":1.3272058823529411},{"$f":"IF(M16=0,\"\",(M16-G4)/G5)","v":0.58158158158158157},{"$f":"IF(N16=0,\"\",(N16-H4)/H5)","v":0.23987854251012136},{"$f":"IF(O16=0,\"\",(O16-I4)/I5)","v":-0.37060041407867494},"Ages 7 - 11"]
[null,null,null,null,null,null,null,null,null,null,null,{"$f":"100+L17*(15)","v":119.90808823529412},{"$f":"100+M17*(15)","v":108.72372372372372},103.59817813765181,94.440993788819881,"Standard Score"]
[null,null,null,null,null,null,null,null,null,null,null,{"$f":"10*L17+50","v":63.272058823529413},{"$f":"10*M17+50","v":55.815815815815817},52.398785425101217,46.293995859213254,"T-Score"]
[null,null,null,null,null,null,null,null,null,null,null,{"$f":"IF(ISBLANK(L18),\"\",IF(AND(L18>49,L18<70),\"Extremely Below Ave.\",IF(AND(L18>69,L18<80),\"Well-Below Average\",IF(AND(L18>79,L18<90),\"Below Average\",IF(AND(L18>89,L18<110),\"Average\",IF(AND(L18>109,L18<120),\"Above Average\",IF(AND(L18>119,L18<130),\"Well-Above Average\",IF(AND(L18>129,L18<150),\"Extremely Above Ave.\",\"\"))))))))","v":"Above Average"},{"$f":"IF(ISBLANK(M18),\"\",IF(AND(M18>49,M18<70),\"Extremely Below Ave.\",IF(AND(M18>69,M18<80),\"Well-Below Average\",IF(AND(M18>79,M18<90),\"Below Average\",IF(AND(M18>89,M18<110),\"Average\",IF(AND(M18>109,M18<120),\"Above Average\",IF(AND(M18>119,M18<130),\"Well-Above Average\",IF(AND(M18>129,M18<150),\"Extremely Above Ave.\",\"\"))))))))","v":"Average"},"Average","Average","Classification"]
[null,null,null,null,null,null,null,null,null,null,null,{"$f":"IF(L16=0,\"\",(L16-F8)/F9)","v":1.7438136826783115},{"$f":"IF(M16=0,\"\",(M16-G8)/G9)","v":0.91690140845070423},{"$f":"IF(N16=0,\"\",(N16-H8)/H9)","v":0.42678347934918648},{"$f":"IF(O16=0,\"\",(O16-I8)/I9)","v":-0.45771144278606968},"Ages 12 - 16"]
[null,null,null,null,null,null,null,null,null,null,null,{"$f":"100+L21*(15)","v":126.15720524017468},{"$f":"100+M21*(15)","v":113.75352112676056},106.4017521902378,93.134328358208961,"Standard Score"]
[null,null,null,null,null,null,null,null,null,null,null,{"$f":"10*L21+50","v":67.438136826783108},{"$f":"10*M21+50","v":59.16901408450704},54.267834793491865,45.4228855721393,"T-Score"]
[null,null,null,null,null,null,null,null,null,null,null,{"$f":"IF(ISBLANK(L22),\"\",IF(AND(L22>49,L22<70),\"Extremely Below Ave.\",IF(AND(L22>69,L22<80),\"Well-Below Average\",IF(AND(L22>79,L22<90),\"Below Average\",IF(AND(L22>89,L22<110),\"Average\",IF(AND(L22>109,L22<120),\"Above Average\",IF(AND(L22>119,L22<130),\"Well-Above Average\",IF(AND(L22>129,L22<150),\"Extremely Above Ave.\",\"\"))))))))","v":"Well-Above Average"},{"$f":"IF(ISBLANK(M22),\"\",IF(AND(M22>49,M22<70),\"Extremely Below Ave.\",IF(AND(M22>69,M22<80),\"Well-Below Average\",IF(AND(M22>79,M22<90),\"Below Average\",IF(AND(M22>89,M22<110),\"Average\",IF(AND(M22>109,M22<120),\"Above Average\",IF(AND(M22>119,M22<130),\"Well-Above Average\",IF(AND(M22>129,M22<150),\"Extremely Above Ave.\",\"\"))))))))","v":"Above Average"},"Average","Average","Classification"]
[]
[]
[]
[null,null,null,null,null,null,null,null,null,null,"Name: ",{"$f":"'Student Data Entry'!$AA$1","v":"John Doe"},null,"Age: ",{"$f":"'Student Data Entry'!$AE$1","v":12}]
[]
[]
[]
[]
[]
[]
[]
[]
[]
[]
[]
[]
[]
[]
[]
[]
[]
[]
[null,"psych"]

{"sheet":"Item Analysis","index":3,"n_rows":57,"n_cols":3,"rows_kept":57,"cut":false,"hidden":false,"merged":[[0,0,0,2]]}
["Children's Automatic Thoughts Scale - Negative & Positive (CATS-N/P)"]
["#","Questionnaire Items","Ratings"]
[null,"Physical Threat"]
[6,"I’m going to have an accident",{"$f":"'Student Data Entry'!$Y$8","v":2}]
[9," I’m going crazy",{"$f":"'Student Data Entry'!$Q$12","v":2}]
[12,"I’m going to die",{"$f":"'Student Data Entry'!$Y$14","v":0}]
[15,"My mom or dad are going to get hurt",{"$f":"'Student Data Entry'!$Q$18","v":2}]
[20,"I’m scared of losing control",{"$f":"'Student Data Entry'!$Y$22","v":1}]
[25,"I’m going to get hurt",{"$f":"'Student Data Entry'!$Q$28","v":1}]
[30,"Something awful is going to happen",{"$f":"'Student Data Entry'!$Y$32","v":3}]
[42,"I’m scared that somebody might die",{"$f":"'Student Data Entry'!$Y$44","v":2}]
[46,"There is something very wrong with me",{"$f":"'Student Data Entry'!$Y$48","v":4}]
[49,"Something will happen to someone I care about",{"$f":"'Student Data Entry'!$Q$52","v":2}]
[null,"Social Threat"]
[2," Kids will think I’m stupid",{"$f":"'Student Data Entry'!$Y$4","v":2}]
[8,"I’m worried that I’m going to get teased",{"$f":"'Student Data Entry'!$Y$10","v":2}]
[10,"Kids are going to laugh at me",{"$f":"'Student Data Entry'!$Y$12","v":3}]
[17,"I’m going to look silly",{"$f":"'Student Data Entry'!$Q$20","v":0}]
[23,"People are thinking bad things about me",{"$f":"'Student Data Entry'!$Q$26","v":1}]
[26,"I’m afraid of what other kids will think of me",{"$f":"'Student Data Entry'!$Y$28","v":1}]
[31,"I look like an idiot",{"$f":"'Student Data Entry'!$Q$34","v":0}]
[36,"Other kids are making fun of me",{"$f":"'Student Data Entry'!$Y$38","v":3}]
[39,"Everyone is staring at me",{"$f":"'Student Data Entry'!$Q$42","v":2}]
[41,"I’m afraid I will make a fool of myself",{"$f":"'Student Data Entry'!$Q$44","v":2}]
[null,"Failure"]
[5,"I can’t do anything right",{"$f":"'Student Data Entry'!$Q$8","v":1}]
[14,"I am worthless",{"$f":"'Student Data Entry'!$Y$16","v":3}]
[16,"Nothing ever works out for me anymore",{"$f":"'Student Data Entry'!$Y$18","v":1}]
[22,"It’s my fault that things have gone wrong",{"$f":"'Student Data Entry'!$Y$24","v":3}]
[29,"I’ve made such a mess of my life",{"$f":"'Student Data Entry'!$Q$32","v":1}]
[33,"I’ll never be as good as other people are",{"$f":"'Student Data Entry'!$Q$36","v":0}]
[35,"I am a failure",{"$f":"'Student Data Entry'!$Q$38","v":1}]
[38,"Life is not worth living",{"$f":"'Student Data Entry'!$Y$40","v":1}]
[43,"I will never overcome my problems",{"$f":"'Student Data Entry'!$Q$46","v":0}]
[48,"I hate myself",{"$f":"'Student Data Entry'!$Y$50","v":0}]
[null,"Hostility"]
[4," I have the right to take revenge on people if they deserve it",{"$f":"'Student Data Entry'!$Y$6","v":1}]
[7,"Other kids are stupid",{"$f":"'Student Data Entry'!$Q$10","v":3}]
[13,"Most people are against me",{"$f":"'Student Data Entry'!$Q$16","v":1}]
[18,"I won’t let anyone get away with picking on me",{"$f":"'Student Data Entry'!$Y$20","v":0}]
[24,"If someone hurts me, I have the right to hurt them back",{"$f":"'Student Data Entry'!$Y$26","v":0}]
[27,"Some people deserve what they get",{"$f":"'Student Data Entry'!$Q$30","v":2}]
[34,"I always get blamed for things that are not my fault",{"$f":"'Student Data Entry'!$Y$36","v":1}]
[44,"People always try to get me into trouble",{"$f":"'Student Data Entry'!$Y$46","v":2}]
[47,"Some people are bad",{"$f":"'Student Data Entry'!$Q$50","v":0}]
[50,"Bad people deserve to get punished",{"$f":"'Student Data Entry'!$Y$52","v":0}]
[null,"Positive Thoughts"]
[1,"I enjoy life",{"$f":"'Student Data Entry'!$Q$4","v":1}]
[3,"I know that everything I do will work out well",{"$f":"'Student Data Entry'!$Q$6","v":2}]
[11,"I don’t give up",{"$f":"'Student Data Entry'!$Q$14","v":0}]
[19,"Other people understand me",{"$f":"'Student Data Entry'!$Q$22","v":0}]
[21,"Only good things will happen to me",{"$f":"'Student Data Entry'!$Q$24","v":2}]
[28,"I feel good about myself",{"$f":"'Student Data Entry'!$Y$30","v":2}]
[32,"My future looks bright",{"$f":"'Student Data Entry'!$Y$34","v":0}]
[37,"Everything will turn out well",{"$f":"'Student Data Entry'!$Q$40","v":2}]
[40,"Kids my age like me",{"$f":"'Student Data Entry'!$Y$42","v":3}]
[45,"I feel great",{"$f":"'Student Data Entry'!$Q$48","v":3}]

{"sheet":"Child Feedback","index":4,"n_rows":0,"n_cols":0,"rows_kept":0,"cut":false,"hidden":false,"merged":[]}

{"sheet":"Adolescent Feedback","index":5,"n_rows":0,"n_cols":0,"rows_kept":0,"cut":false,"hidden":false,"merged":[]}

{"sheet":"Clinician Entry & Analysis","index":6,"n_rows":52,"n_cols":22,"rows_kept":52,"cut":false,"hidden":false,"merged":[[0,0,0,2],[0,5,0,9],[1,12,1,13]]}
["Children's Automatic Thoughts Scale - Negative & Positive (CATS-N/P)",null,null,null,null,"CATS-N/P Scale Totals"]
["#","Questionnaire Item","Rating",null,null,"Physical Threat","Social Threat","Failure","Hostility","Positive Thoughts",null,"Name: ",null,null,"Age: ",11]
[1,"I enjoy life",null,{"$f":"IF(C3>4,\"Invalid Rating\",\"\")","v":""},"Raw Scores",{"$f":"SUM(C8,C11,C14,C17,C22,C27,C32,C44,C48,C51)","v":0},{"$f":"SUM(C4,C10,C12,C19,C25,C28,C33,C38,C41,C43)","v":0},{"$f":"SUM(C7,C16,C18,C24,C31,C35,C37,C40,C45,C50)","v":0},{"$f":"SUM(C6,C9,C15,C20,C26,C29,C36,C46,C49,C52)","v":0},{"$f":"SUM(C3,C5,C13,C21,C23,C30,C34,C39,C42,C47)","v":0}]
[2," Kids will think I’m stupid",null,{"$f":"IF(C4>4,\"Invalid Rating\",\"\")","v":""},"Norm Averages",6.43,8.65,7.3,11.87,21.67,"Ages 8 - 11"]
[3,"I know that everything I do will work out well",null,"","Norm SDs",5.76,6.69,6.18,6.87,7.94,null,null,null,null,null,null,"Physical Threat","Social Threat","Failure","Hostility","Positive Thoughts"]
[4," I have the right to take revenge on people if they deserve it",null,"","Sig.Cut-off",{"$f":"SUM(F4,F5)+(F5/2)","v":15.07},{"$f":"SUM(G4,G5)+(G5/2)","v":18.684999999999999},16.57,22.174999999999997,{"$f":"(J4-J5)-(J5/2)","v":9.76},null,null,null,null,null,null,{"$f":"$F$3","v":0},{"$f":"$G$3","v":0},{"$f":"$H$3","v":0},{"$f":"$I$3","v":0},{"$f":"$J$3","v":0},"Raw Scores"]
[5,"I can’t do anything right",null,"",null,{"$f":"IF(F3>15.07,\"Significant\",\"\")","v":""},{"$f":"IF(G3>18.69,\"Significant\",\"\")","v":""},{"$f":"IF(H3>16.57,\"Significant\",\"\")","v":""},{"$f":"IF(I3>22.18,\"Significant\",\"\")","v":""},{"$f":"IF(AND(J3>0,J3<9.76),\"Significant\",\"\")","v":""},null,null,null,null,null,null,{"$f":"IF(Q6=0,\"\",(Q6-F4)/F5)","v":""},{"$f":"IF(R6=0,\"\",(R6-G4)/G5)","v":""},"","","","Ages 8 - 11"]
[6,"I’m going to have an accident",null,"","Norm Averages",4.63,6.32,4.49,11.25,22.3,"Ages 12 - 18",null,null,null,null,null,{"$f":"100+Q7*(15)","v":{"$error":"#VALUE!"}},{"$f":"100+R7*(15)","v":{"$error":"#VALUE!"}},{"$error":"#VALUE!"},{"$error":"#VALUE!"},{"$error":"#VALUE!"},"Standard Score"]
[7,"Other kids are stupid",null,"","Norm SDs",5.61,6.69,5.94,7.66,8.2200000000000006,null,null,null,null,null,null,{"$f":"10*Q7+50","v":{"$error":"#VALUE!"}},{"$f":"10*R7+50","v":{"$error":"#VALUE!"}},{"$error":"#VALUE!"},{"$error":"#VALUE!"},{"$error":"#VALUE!"},"T-Score"]
[8,"I’m worried that I’m going to get teased",null,"","Sig.Cut-off",{"$f":"SUM(F8,F9)+(F9/2)","v":13.045},{"$f":"SUM(G8,G9)+(G9/2)","v":16.355},{"$f":"SUM(H8,H9)+(H9/2)","v":13.4},{"$f":"SUM(I8,I9)+(I9/2)","v":22.740000000000002},{"$f":"(J8-J9)-(J9/2)","v":9.9699999999999989},null,null,null,null,null,null,{"$f":"IF(ISBLANK(Q8),\"\",IF(AND(Q8>49,Q8<70),\"Extremely Below Ave.\",IF(AND(Q8>69,Q8<80),\"Well-Below Average\",IF(AND(Q8>79,Q8<90),\"Below Average\",IF(AND(Q8>89,Q8<110),\"Average\",IF(AND(Q8>109,Q8<120),\"Above Average\",IF(AND(Q8>119,Q8<130),\"Well-Above Average\",IF(AND(Q8>129,Q8<140),\"Extremely Above Ave.\",\"\"))))))))","v":{"$error":"#VALUE!"}},{"$f":"IF(ISBLANK(R8),\"\",IF(AND(R8>49,R8<70),\"Extremely Below Ave.\",IF(AND(R8>69,R8<80),\"Well-Below Average\",IF(AND(R8>79,R8<90),\"Below Average\",IF(AND(R8>89,R8<110),\"Average\",IF(AND(R8>109,R8<120),\"Above Average\",IF(AND(R8>119,R8<130),\"Well-Above Average\",IF(AND(R8>129,R8<140),\"Extremely Above Ave.\",\"\"))))))))","v":{"$error":"#VALUE!"}},{"$error":"#VALUE!"},{"$error":"#VALUE!"},{"$error":"#VALUE!"},"Classification"]
[9," I’m going crazy",null,"",null,{"$f":"IF(F3>13.05,\"Significant\",\"\")","v":""},{"$f":"IF(G3>16.36,\"Significant\",\"\")","v":""},{"$f":"IF(H3>13.4,\"Significant\",\"\")","v":""},{"$f":"IF(I3>22.74,\"Significant\",\"\")","v":""},{"$f":"IF(AND(J3>0,J3<9.97),\"Significant\",\"\")","v":""},null,null,null,null,null,null,{"$f":"IF(Q6=0,\"\",(Q6-F8)/F9)","v":""},{"$f":"IF(R6=0,\"\",(R6-G8)/G9)","v":""},"","","","Ages 12 - 18"]
[10,"Kids are going to laugh at me",null,"",null,null,null,null,null,null,null,null,null,null,null,null,{"$f":"100+Q11*(15)","v":{"$error":"#VALUE!"}},{"$f":"100+R11*(15)","v":{"$error":"#VALUE!"}},{"$error":"#VALUE!"},{"$error":"#VALUE!"},{"$error":"#VALUE!"},"Standard Score"]
[11,"I don’t give up",null,"",null,null,null,null,null,null,null,null,null,null,null,null,{"$f":"10*Q11+50","v":{"$error":"#VALUE!"}},{"$f":"10*R11+50","v":{"$error":"#VALUE!"}},{"$error":"#VALUE!"},{"$error":"#VALUE!"},{"$error":"#VALUE!"},"T-Score"]
[12,"I’m going to die",null,"",null,null,null,null,null,null,null,null,null,null,null,null,{"$f":"IF(ISBLANK(Q12),\"\",IF(AND(Q12>49,Q12<70),\"Extremely Below Ave.\",IF(AND(Q12>69,Q12<80),\"Well-Below Average\",IF(AND(Q12>79,Q12<90),\"Below Average\",IF(AND(Q12>89,Q12<110),\"Average\",IF(AND(Q12>109,Q12<120),\"Above Average\",IF(AND(Q12>119,Q12<130),\"Well-Above Average\",IF(AND(Q12>129,Q12<140),\"Extremely Above Ave.\",\"\"))))))))","v":{"$error":"#VALUE!"}},{"$f":"IF(ISBLANK(R12),\"\",IF(AND(R12>49,R12<70),\"Extremely Below Ave.\",IF(AND(R12>69,R12<80),\"Well-Below Average\",IF(AND(R12>79,R12<90),\"Below Average\",IF(AND(R12>89,R12<110),\"Average\",IF(AND(R12>109,R12<120),\"Above Average\",IF(AND(R12>119,R12<130),\"Well-Above Average\",IF(AND(R12>129,R12<140),\"Extremely Above Ave.\",\"\"))))))))","v":{"$error":"#VALUE!"}},{"$error":"#VALUE!"},{"$error":"#VALUE!"},{"$error":"#VALUE!"},"Classification"]
[13,"Most people are against me",null,""]
[14,"I am worthless",null,""]
[15,"My mom or dad are going to get hurt",null,""]
[16,"Nothing ever works out for me anymore",null,""]
[17,"I’m going to look silly",null,""]
[18,"I won’t let anyone get away with picking on me",null,""]
[19,"Other people understand me",null,""]
[20,"I’m scared of losing control",null,""]
[21,"Only good things will happen to me",null,""]
[22,"It’s my fault that things have gone wrong",null,""]
[23,"People are thinking bad things about me",null,""]
[24,"If someone hurts me, I have the right to hurt them back",null,""]
[25,"I’m going to get hurt",null,""]
[26,"I’m afraid of what other kids will think of me",null,""]
[27,"Some people deserve what they get",null,""]
[28,"I feel good about myself",null,""]
[29,"I’ve made such a mess of my life",null,""]
[30,"Something awful is going to happen",null,""]
[31,"I look like an idiot",null,""]
[32,"My future looks bright",null,""]
[33,"I’ll never be as good as other people are",null,""]
[34,"I always get blamed for things that are not my fault",null,""]
[35,"I am a failure",null,""]
[36,"Other kids are making fun of me",null,""]
[37,"Everything will turn out well",null,""]
[38,"Life is not worth living",null,""]
[39,"Everyone is staring at me",null,""]
[40,"Kids my age like me",null,""]
[41,"I’m afraid I will make a fool of myself",null,""]
[42,"I’m scared that somebody might die",null,""]
[43,"I will never overcome my problems",null,""]
[44,"People always try to get me into trouble",null,""]
[45,"I feel great",null,""]
[46,"There is something very wrong with me",null,""]
[47,"Some people are bad",null,""]
[48,"I hate myself",null,""]
[49,"Something will happen to someone I care about",null,""]
[50,"Bad people deserve to get punished",null,""]

{"sheet":"Group Data","index":7,"n_rows":34,"n_cols":13,"rows_kept":34,"cut":false,"hidden":false,"merged":[[0,2,0,6],[0,8,0,11]]}
[null,null,"CATS-N/P Norms used",null,null,null,null,"Negative Thoughts","CATS norms used",null,null,null,"Negative Thoughts"]
["Student Names",null,"Physical Threat","Social Threat","Failure","Hostility","Positive Thoughts","Average","Physical Threat","Social Threat","Failure","Hostility","Average"]
["Marsha Penner",null,124.921875,107.51121076233184,118.68932038834951,115.56768558951966,87.399244332493694,{"$f":"AVERAGE(C3:F3)","v":116.67252293505025},114.39338235294117,102.71771771771772,109.67105263157895,108.41614906832298,{"$f":"AVERAGE(I3:L3)","v":108.7995754426402}]
["Jeff Reimer",null,145.75520833333334,134.4170403587444,128.39805825242718,126.48471615720524,93.066750629722918,{"$f":"AVERAGE(C4:F4)","v":133.76375577542754},129.09926470588235,120.73573573573574,115.74392712550608,116.18012422360249,{"$f":"AVERAGE(I4:L4)","v":120.43976294768167}]
["Steve Anderson",null,114.50520833333333,98.542600896860989,111.40776699029126,104.65065502183407,89.288413098236774,107.2765578105799,107.04044117647059,96.711711711711715,105.1163967611336,100.65217391304348,102.38018089058986]
["Donald Trump",null,85.859375,98.542600896860989,84.708737864077676,133.03493449781661,119.51511335012594,100.53641206468882,86.819852941176464,96.711711711711715,88.415991902834008,120.83850931677019,98.196516468123079]
[null,null,null,null,null,null,null,{"$error":"#DIV/0!"},null,null,null,null,{"$error":"#DIV/0!"}]
[null,null,null,null,null,null,null,{"$error":"#DIV/0!"},null,null,null,null,{"$error":"#DIV/0!"}]
[null,null,null,null,null,null,null,{"$error":"#DIV/0!"},null,null,null,null,{"$error":"#DIV/0!"}]
[null,null,null,null,null,null,null,{"$error":"#DIV/0!"},null,null,null,null,{"$error":"#DIV/0!"}]
[null,null,null,null,null,null,null,{"$error":"#DIV/0!"},null,null,null,null,{"$error":"#DIV/0!"}]
[null,null,null,null,null,null,null,{"$error":"#DIV/0!"},null,null,null,null,{"$error":"#DIV/0!"}]
[null,null,null,null,null,null,null,{"$error":"#DIV/0!"},null,null,null,null,{"$error":"#DIV/0!"}]
[null,null,null,null,null,null,null,{"$error":"#DIV/0!"},null,null,null,null,{"$error":"#DIV/0!"}]
[null,null,null,null,null,null,null,{"$error":"#DIV/0!"},null,null,null,null,{"$error":"#DIV/0!"}]
[null,null,null,null,null,null,null,{"$error":"#DIV/0!"},null,null,null,null,{"$error":"#DIV/0!"}]
[null,null,null,null,null,null,null,{"$error":"#DIV/0!"},null,null,null,null,{"$error":"#DIV/0!"}]
[null,null,null,null,null,null,null,{"$error":"#DIV/0!"},null,null,null,null,{"$error":"#DIV/0!"}]
[null,null,null,null,null,null,null,{"$error":"#DIV/0!"},null,null,null,null,{"$error":"#DIV/0!"}]
[null,null,null,null,null,null,null,{"$error":"#DIV/0!"},null,null,null,null,{"$error":"#DIV/0!"}]
[null,null,null,null,null,null,null,{"$error":"#DIV/0!"},null,null,null,null,{"$error":"#DIV/0!"}]
[null,null,null,null,null,null,null,{"$error":"#DIV/0!"},null,null,null,null,{"$error":"#DIV/0!"}]
[null,null,null,null,null,null,null,{"$error":"#DIV/0!"},null,null,null,null,{"$error":"#DIV/0!"}]
[null,null,null,null,null,null,null,{"$error":"#DIV/0!"},null,null,null,null,{"$error":"#DIV/0!"}]
[null,null,null,null,null,null,null,{"$error":"#DIV/0!"},null,null,null,null,{"$error":"#DIV/0!"}]
[null,null,null,null,null,null,null,{"$error":"#DIV/0!"},null,null,null,null,{"$error":"#DIV/0!"}]
[null,null,null,null,null,null,null,{"$error":"#DIV/0!"},null,null,null,null,{"$error":"#DIV/0!"}]
[null,null,null,null,null,null,null,{"$error":"#DIV/0!"},null,null,null,null,{"$error":"#DIV/0!"}]
[null,null,null,null,null,null,null,{"$error":"#DIV/0!"},null,null,null,null,{"$error":"#DIV/0!"}]
[null,null,null,null,null,null,null,{"$f":"AVERAGE(C30:F30)","v":{"$error":"#DIV/0!"}},null,null,null,null,{"$f":"AVERAGE(I30:L30)","v":{"$error":"#DIV/0!"}}]
[null,null,null,null,null,null,null,{"$f":"AVERAGE(C31:F31)","v":{"$error":"#DIV/0!"}},null,null,null,null,{"$f":"AVERAGE(I31:L31)","v":{"$error":"#DIV/0!"}}]
[null,null,null,null,null,null,null,{"$error":"#DIV/0!"},null,null,null,null,{"$error":"#DIV/0!"}]
[null,null,null,null,null,null,null,{"$error":"#DIV/0!"},null,null,null,null,{"$error":"#DIV/0!"}]
["AVERAGES:",null,{"$f":"AVERAGE(C3:C33)","v":117.76041666666667},{"$f":"AVERAGE(D3:D33)","v":109.75336322869956},110.80097087378641,119.9344978165939,97.317380352644832,{"$f":"+AVERAGE(C34:F34)","v":114.56231214643662},{"$f":"+AVERAGE(I3:I33)","v":109.33823529411765},{"$f":"+AVERAGE(J3:J33)","v":104.21921921921921},104.73684210526315,111.52173913043478,{"$f":"AVERAGE(I34:L34)","v":107.45400893725869}]

{"sheet":"SS to Percentile","index":8,"n_rows":0,"n_cols":0,"rows_kept":0,"cut":false,"hidden":false,"merged":[]}

{"sheet":"Data for Local Norms","index":9,"n_rows":52,"n_cols":8,"rows_kept":52,"cut":false,"hidden":false,"merged":[[0,8,0,12],[0,2,0,6]]}
[null,null,"CATS-N/P Raw Scores",null,null,null,null,"Negative Thoughts"]
["Student Names",null,"Physical Threat","Social Threat","Failure","Hostility","Positive Thoughts","Average"]
["Marsha Penner",null,12,16,4,16,12,{"$f":"AVERAGE(C3:F3)","v":12}]
["Jeff Reimer",null,15,18,16,10,4,{"$f":"AVERAGE(C4:G4)","v":12.6}]
["Steve Wasnia",null,3,8,2,2,30,{"$f":"AVERAGE(C5:F5)","v":3.75}]
["Donald Trump",null,7,13,1,28,19,12.25]
[null,null,null,null,null,null,null,{"$error":"#DIV/0!"}]
[null,null,null,null,null,null,null,{"$error":"#DIV/0!"}]
[null,null,null,null,null,null,null,{"$error":"#DIV/0!"}]
[null,null,null,null,null,null,null,{"$error":"#DIV/0!"}]
[null,null,null,null,null,null,null,{"$error":"#DIV/0!"}]
[null,null,null,null,null,null,null,{"$error":"#DIV/0!"}]
[null,null,null,null,null,null,null,{"$error":"#DIV/0!"}]
[null,null,null,null,null,null,null,{"$error":"#DIV/0!"}]
[null,null,null,null,null,null,null,{"$error":"#DIV/0!"}]
[null,null,null,null,null,null,null,{"$error":"#DIV/0!"}]
[null,null,null,null,null,null,null,{"$error":"#DIV/0!"}]
[null,null,null,null,null,null,null,{"$error":"#DIV/0!"}]
[null,null,null,null,null,null,null,{"$error":"#DIV/0!"}]
[null,null,null,null,null,null,null,{"$error":"#DIV/0!"}]
[null,null,null,null,null,null,null,{"$error":"#DIV/0!"}]
[null,null,null,null,null,null,null,{"$error":"#DIV/0!"}]
[null,null,null,null,null,null,null,{"$error":"#DIV/0!"}]
[null,null,null,null,null,null,null,{"$error":"#DIV/0!"}]
[null,null,null,null,null,null,null,{"$error":"#DIV/0!"}]
[null,null,null,null,null,null,null,{"$error":"#DIV/0!"}]
[null,null,null,null,null,null,null,{"$error":"#DIV/0!"}]
[null,null,null,null,null,null,null,{"$error":"#DIV/0!"}]
[null,null,null,null,null,null,null,{"$error":"#DIV/0!"}]
[null,null,null,null,null,null,null,{"$error":"#DIV/0!"}]
[null,null,null,null,null,null,null,{"$error":"#DIV/0!"}]
[null,null,null,null,null,null,null,{"$error":"#DIV/0!"}]
[null,null,null,null,null,null,null,{"$error":"#DIV/0!"}]
[null,null,null,null,null,null,null,{"$error":"#DIV/0!"}]
[null,null,null,null,null,null,null,{"$error":"#DIV/0!"}]
[null,null,null,null,null,null,null,{"$error":"#DIV/0!"}]
[null,null,null,null,null,null,null,{"$error":"#DIV/0!"}]
[null,null,null,null,null,null,null,{"$error":"#DIV/0!"}]
[null,null,null,null,null,null,null,{"$error":"#DIV/0!"}]
[null,null,null,null,null,null,null,{"$error":"#DIV/0!"}]
[null,null,null,null,null,null,null,{"$error":"#DIV/0!"}]
[null,null,null,null,null,null,null,{"$error":"#DIV/0!"}]
[null,null,null,null,null,null,null,{"$error":"#DIV/0!"}]
[null,null,null,null,null,null,null,{"$error":"#DIV/0!"}]
[null,null,null,null,null,null,null,{"$error":"#DIV/0!"}]
[null,null,null,null,null,null,null,{"$error":"#DIV/0!"}]
[null,null,null,null,null,null,null,{"$error":"#DIV/0!"}]
[null,null,null,null,null,null,null,{"$error":"#DIV/0!"}]
[null,null,null,null,null,null,null,{"$error":"#DIV/0!"}]
[null,null,null,null,null,null,null,{"$error":"#DIV/0!"}]
["AVERAGES:",null,{"$f":"AVERAGE(C3:C50)","v":9.25},{"$f":"AVERAGE(D3:D50)","v":13.75},{"$f":"AVERAGE(E3:E50)","v":5.75},{"$f":"AVERAGE(F3:F50)","v":14},{"$f":"AVERAGE(G3:G50)","v":16.25},{"$f":"+AVERAGE(C51:F51)","v":10.6875}]
["Standard Deviations:",null,{"$f":"STDEV(C3:C50)","v":5.315072906367325},{"$f":"STDEV(D3:D50)","v":4.349329450233296},{"$f":"STDEV(E3:E50)","v":6.946221994724902},{"$f":"STDEV(F3:F50)","v":10.954451150103322},{"$f":"STDEV(G3:G50)","v":11.026483271348727},{"$f":"AVERAGE(C52:F52)","v":6.8912688753572109}]