{"text_format":"1","workbook":"xlsx","n_sheets":16,"sheets":["Data Entry","Group Graphs","Graph of Raw Scores","Class 1","Class 2","Class 3","Class 4","Class 5"," Std Sc. Graph 1"," Std Sc. Graph 2"," Std Sc. Graph 3"," Std Sc. Graph 4"," Std Sc. Graph 5","Division Norms","Schools x Skills","Skills x Schools"],"not_rendered":{"charts":26,"images":1,"macros":1,"external_links":0,"defined_names":21,"comments":0,"pivot_tables":0},"unopened":[],"bounds":{"document_bytes":16777216,"sheet_cells":100000,"rows_first":2000,"rows_last":500,"rows_between":2000,"halvings":0,"cell_chars":16384,"cell_head_chars":4096},"cells_cut":0,"cells_raw":0,"read":"whole","date_system":"1900"}

{"sheet":"Data Entry","index":0,"n_rows":107,"n_cols":11,"rows_kept":107,"cut":false,"hidden":false,"merged":[[0,2,1,2],[0,9,1,9],[0,6,1,6],[0,4,1,4],[0,5,1,5],[0,7,1,7],[0,8,1,8],[0,3,1,3]]}
[null,"Early Literacy Screener","Blending Syllables","Segmenting to Syllables","Blending Phonemes","Segmenting to Phonemes","PHONOLOGICAL AVERAGE","Phonological Memory","Letter Naming Fluency","TOTAL Raw Score %"]
[null,"Students' Names",null,null,null,null,null,null,null,null,"Mean"]
[1,"Akinomesk, Joshua",5,4,4,5,{"$f":"SUM(E3:F3)/2","v":4.5},8,45,{"$f":"SUM(C3:F3,H3:I3)","v":71},{"$f":"$J$103","v":44.551724137931032}]
[2,"Anderski, Violet",4,3,3,2,{"$f":"SUM(E4:F4)/2","v":2.5},8,33,{"$f":"SUM(C4:F4,H4:I4)","v":53},{"$f":"$J$103","v":44.551724137931032}]
[3,"Actara, Belle",2,2,1,0,0.5,3,2,10,{"$f":"$J$103","v":44.551724137931032}]
[4,"Bandito, Nicole",3,2,1,2,1.5,4,13,25,44.551724137931032]
[5,"Capriano, Geno",5,4,4,3,3.5,6,45,67,44.551724137931032]
[6,"Dweck, Kaori",5,3,3,3,3,5,37,56,44.551724137931032]
[7,"Essman, Cal",3,2,2,1,1.5,8,30,46,44.551724137931032]
[8,"Fast, Autumn",5,4,3,2,2.5,6,41,61,44.551724137931032]
[9,"Greenwall, Brayden",5,5,4,4,4,8,40,66,44.551724137931032]
[10,"Hallenko, Pierce",2,2,0,2,1,4,9,19,44.551724137931032]
[11,"Lowen, Hunter",5,1,4,0,2,7,35,52,44.551724137931032]
[12,"Marbel, Melody",5,3,5,2,3.5,9,18,42,44.551724137931032]
[13,"Peterson, Carmen",3,1,0,0,0,4,9,17,44.551724137931032]
[14,"Rice, Bruce",2,1,0,0,0,8,33,44,44.551724137931032]
[15,"Broman, Clara",5,2,4,2,3,7,19,39,44.551724137931032]
[16,"Catchy, Danny",5,3,5,2,3.5,4,33,52,44.551724137931032]
[17,"Cayburn, Karl",4,3,4,3,3.5,7,36,57,44.551724137931032]
[18,"Demonslayer, Darryl",3,2,1,0,0.5,6,10,22,44.551724137931032]
[19,"Hanson, Sawyer",3,1,2,0,1,3,11,20,44.551724137931032]
[20,"Hiebert, Bruce",5,3,5,3,4,5,48,69,44.551724137931032]
[21,"Heidelburg, Corby",3,3,2,3,2.5,7,37,55,44.551724137931032]
[22,"Krinkle, Luke",2,2,2,1,1.5,4,23,34,44.551724137931032]
[23,"Lagensky, Patty",3,0,1,1,1,3,12,20,44.551724137931032]
[24,"Lorrey, Fred",4,1,1,2,1.5,5,14,27,44.551724137931032]
[25,"Marvel, Captain",3,2,2,2,2,4,24,37,44.551724137931032]
[26,"Manswella, Rico",3,2,3,1,2,7,34,50,44.551724137931032]
[27,"Ohera, Marian",2,3,2,2,2,6,12,27,44.551724137931032]
[28,"Penner, Annie",3,2,2,2,2,8,23,40,44.551724137931032]
[29,"Sarbucker, Cassedy",4,1,1,3,2,5,12,26,44.551724137931032]
[30,"Schell, John",4,2,2,2,2,6,23,39,{"$f":"$J$103","v":44.551724137931032}]
[31,"Skaper, Leah",3,3,2,1,1.5,4,11,24,{"$f":"$J$103","v":44.551724137931032}]
[32,"Shneider, Ingrid",5,2,3,2,2.5,5,10,27,{"$f":"$J$103","v":44.551724137931032}]
[33,"klywalker, Eric",4,4,4,3,3.5,6,22,43,44.551724137931032]
[34,"Voit, John",3,3,3,3,3,3,32,47,44.551724137931032]
[35,"Benito, Ester",5,2,3,2,2.5,6,19,37,44.551724137931032]
[36,"Dorito, Danny",2,3,2,2,2,3,10,22,44.551724137931032]
[37,"Friesen, Elaine",4,3,3,3,3,8,38,59,44.551724137931032]
[38,"Fronk, Clara",2,3,3,2,2.5,4,45,59,44.551724137931032]
[39,"Gillingham, Teddy",5,4,3,2,2.5,3,23,40,44.551724137931032]
[40,"Harder, Hellen",4,2,3,2,2.5,3,44,58,44.551724137931032]
[41,"Heinrichs, Audrey",4,3,2,1,1.5,4,35,49,44.551724137931032]
[42,"Hofmann, Joan",4,4,4,1,2.5,8,48,69,44.551724137931032]
[43,"Klippenstein, Joey",3,3,4,2,3,7,35,54,44.551724137931032]
[44,"Kolair, Henry",5,3,5,2,3.5,8,42,65,44.551724137931032]
[45,"Marquette, Ryan",5,3,3,2,2.5,7,41,61,44.551724137931032]
[46,"Martin, Katie",4,4,4,3,3.5,8,47,70,44.551724137931032]
[47,"Mutch, Jayden",3,2,2,2,2,6,32,47,44.551724137931032]
[48,"Penner, Robert",4,2,3,3,3,7,39,58,44.551724137931032]
[49,"Schultz, Mario",2,1,3,3,3,5,33,47,44.551724137931032]
[50,"Smith, Abby",4,3,4,2,3,5,37,55,44.551724137931032]
[51,"Vogt, Adelle",4,2,4,3,3.5,7,42,62,44.551724137931032]
[52,"Zilberman, Toni",3,3,5,2,3.5,6,23,42,44.551724137931032]
[53,"Ardene, Mary",4,2,4,2,3,6,35,53,{"$f":"$J$103","v":44.551724137931032}]
[54,"Brother, Peter",5,3,5,2,3.5,8,39,62,{"$f":"$J$103","v":44.551724137931032}]
[55,"Bugeate, Moreen",2,1,2,1,1.5,2,12,20,{"$f":"$J$103","v":44.551724137931032}]
[56,"Candy, William",4,2,2,2,2,5,34,49,44.551724137931032]
[57,"Dyck, Teddy",4,2,2,2,2,5,23,38,44.551724137931032]
[58,"Hudson, Harriette",5,2,3,1,2,4,43,58,44.551724137931032]
[59,"Messia, Penny",5,3,3,2,2.5,7,28,48,44.551724137931032]
[60,"Penner, Elaine",3,3,2,2,2,8,44,62,44.551724137931032]
[61,"Rajooley, Anna",3,4,4,3,3.5,7,21,42,44.551724137931032]
[62,"Renzulli, Leah",4,4,3,2,2.5,7,18,38,44.551724137931032]
[63,"Roxmeyer, Zoey",2,3,3,3,3,6,32,49,44.551724137931032]
[64,"Sailing, Mark",3,4,3,2,2.5,8,41,61,44.551724137931032]
[65,"Sage, Taber",3,3,5,3,4,8,39,61,44.551724137931032]
[66,"Sarbock, Melanie",4,4,3,3,{"$f":"SUM(E68:F68)/2","v":3},6,31,{"$f":"SUM(C68:F68,H68:I68)","v":51},44.551724137931032]
[67,"Senkiw, John",5,3,3,2,2.5,4,37,54,44.551724137931032]
[68,"Tellery, Simon",4,2,4,2,3,3,34,49,44.551724137931032]
[69,"Ustabar, Vallery",3,3,3,2,2.5,6,25,42,44.551724137931032]
[70,"Zark, Timmy",3,2,2,1,1.5,4,22,34,44.551724137931032]
[71,"Belburg, Elise",5,2,4,2,3,4,18,35,44.551724137931032]
[72,"Brow, Lenny",2,1,2,1,1.5,1,8,15,44.551724137931032]
[73,"Cramer, Sophie",4,3,4,3,3.5,8,36,58,44.551724137931032]
[74,"Dedrington, Nick",5,2,2,1,1.5,3,15,28,44.551724137931032]
[75,"Enns, Benjamin",5,2,1,1,1,3,20,32,44.551724137931032]
[76,"Passenger, Phoebe",4,2,2,2,2,5,42,57,44.551724137931032]
[77,"Pattern, Viyan",3,1,1,1,1,2,14,22,44.551724137931032]
[78,"Pries, Nolan",3,1,1,1,1,3,19,28,44.551724137931032]
[79,"Prodical, Sophie",2,4,3,2,2.5,8,24,43,44.551724137931032]
[80,"Rockport, Sandra",3,3,2,2,2,5,28,43,44.551724137931032]
[81,"Sarkuchi, Danny",3,2,1,1,1,4,22,33,44.551724137931032]
[82,"Schneider, Lucas",4,2,2,1,1.5,4,19,32,{"$f":"$J$103","v":44.551724137931032}]
[83,"Sellandro, Dennis",5,3,3,2,2.5,6,34,53,{"$f":"$J$103","v":44.551724137931032}]
[84,"Wallburg, Rose",4,2,2,1,1.5,7,26,42,{"$f":"$J$103","v":44.551724137931032}]
[85,"Wollmann, Jayson",3,2,1,1,1,3,19,29,44.551724137931032]
[86,"Wood, Anna",4,3,3,2,2.5,9,29,50,{"$f":"$J$103","v":44.551724137931032}]
[87,"Yong, Liam",5,5,3,3,3,9,42,67,{"$f":"$J$103","v":44.551724137931032}]
[88,null,null,null,null,null,0,null,null,0]
[89,null,null,null,null,null,0,null,null,0]
[90,null,null,null,null,null,0,null,null,0]
[91,null,null,null,null,null,0,null,null,0]
[92,null,null,null,null,null,0,null,null,0]
[93,null,null,null,null,null,0,null,null,0]
[94,null,null,null,null,null,0,null,null,0]
[95,null,null,null,null,null,0,null,null,0]
[96,null,null,null,null,null,0,null,null,0]
[97,null,null,null,null,null,0,null,null,0]
[98,null,null,null,null,null,0,null,null,0]
[99,null,null,null,null,null,0,null,null,0]
[100,null,null,null,null,null,0,null,null,0]
[null,"AVERAGES: ",{"$f":"AVERAGE(C3:C102)","v":3.7011494252873565},2.5402298850574714,{"$f":"AVERAGE(E3:E102)","v":2.735632183908046},{"$f":"AVERAGE(F3:F102)","v":1.9195402298850575},{"$f":"AVERAGE(C103:F103)","v":2.7241379310344831},{"$f":"AVERAGE(H3:H102)","v":5.5862068965517242},{"$f":"AVERAGE(I3:I102)","v":28.068965517241381},{"$f":"AVERAGEIF(J3:J102,\"<>0\")","v":44.551724137931032}]
[null,"Standard Deviations: ",{"$f":"STDEV(C3:C102)","v":1.0242971785427288},0.99772529310018343,1.2432119888356568,0.93034615719093861,{"$f":"AVERAGE(C104:F104)","v":1.0488951544173768},1.9442923273958796,11.760985071312451,{"$f":"STDEV(IF(J3:J102<>0,J3:J102))","v":15.14331429783504}]
[null,"Percentages: ",{"$f":"(C103/5)*100","v":74.022988505747136},{"$f":"(D103/5)*100","v":50.804597701149426},54.712643678160923,38.390804597701148,54.482758620689665,{"$f":"H103/10*100","v":55.862068965517238},{"$f":"I103/100*100","v":28.068965517241377},80,"Total Possible"]
[null,{"$f":"COUNTA(B3:B102)","v":87},"Number of Students",null,null,null,null,null,null,{"$f":"J103/80","v":0.55689655172413788},"Total/Tot.Possible"]
[null,null,null,null,null,null,null,null,null,{"$f":"J106*100","v":55.689655172413786},"Percentage"]

{"sheet":"Group Graphs","index":1,"n_rows":0,"n_cols":0,"rows_kept":0,"cut":false,"hidden":false,"merged":[]}

{"sheet":"Graph of Raw Scores","index":2,"n_rows":0,"n_cols":0,"rows_kept":0,"cut":false,"hidden":false,"merged":[]}

{"sheet":"Class 1","index":3,"n_rows":37,"n_cols":16,"rows_kept":37,"cut":false,"hidden":false,"merged":[[0,2,0,5],[2,0,6,0],[2,8,3,8],[2,3,3,3],[2,4,3,4],[2,5,3,5],[2,6,3,6],[2,7,3,7],[2,2,3,2],[1,2,1,5]]}
[null,"Teacher: ","Thelma Doerksen"]
[null,"Grade: ","K1D",null,null,null,null,null,null,null,null,null,null,null,null,"At-Risk Students"]
["#",null,"Blending Syllables","Segmenting to Syllables","Blending Phonemes","Segmenting to Phonemes","Phonological Memory","Letter Naming Fluency","Grand  Total",null,null,null,null,null,null,{"$f":"IF(I8<$I$7,B8,\"\")","v":""}]
[null,null,null,null,null,null,null,null,null,null,null,null,null,null,null,""]
[null,null,{"$f":"'Data Entry'!$C$103","v":3.7011494252873565},{"$f":"'Data Entry'!$D$103","v":2.5402298850574714},{"$f":"'Data Entry'!E103","v":2.735632183908046},{"$f":"'Data Entry'!F103","v":1.9195402298850575},{"$f":"'Data Entry'!H103","v":5.5862068965517242},{"$f":"'Data Entry'!$I$103","v":28.068965517241381},{"$f":"'Data Entry'!J103","v":44.551724137931032},"Means",null,null,null,null,null,"Actara, Belle"]
[null,"Student",{"$f":"'Data Entry'!$C$104","v":1.0242971785427288},{"$f":"'Data Entry'!$D$104","v":0.99772529310018343},{"$f":"'Data Entry'!E104","v":1.2432119888356568},{"$f":"'Data Entry'!F104","v":0.93034615719093861},{"$f":"'Data Entry'!H104","v":1.9442923273958796},{"$f":"'Data Entry'!$I$104","v":11.760985071312451},{"$f":"'Data Entry'!J104","v":15.14331429783504},"Std. Devs.",null,null,null,null,null,"Bandito, Nicole"]
[null,"Names",{"$f":"C5-C6","v":2.6768522467446276},{"$f":"D5-D6","v":1.542504591957288},{"$f":"E5-E6","v":1.4924201950723892},0.98919407269411885,3.6419145691558445,16.30798044592893,{"$f":"I5-(I6)","v":29.408409840095992},"Cut-off Scores",null,null,null,null,null,""]
[1,{"$f":"IF('Data Entry'!B3<>0,'Data Entry'!B3,\"\")","v":"Akinomesk, Joshua"},{"$f":"IF('Data Entry'!C3<>\"\",'Data Entry'!C3,\"\")","v":5},{"$f":"IF('Data Entry'!D3<>\"\",'Data Entry'!D3,\"\")","v":4},{"$f":"IF('Data Entry'!E3<>\"\",'Data Entry'!E3,\"\")","v":4},{"$f":"IF('Data Entry'!F3<>\"\",'Data Entry'!F3,\"\")","v":5},{"$f":"IF('Data Entry'!H3<>\"\",'Data Entry'!H3,\"\")","v":8},{"$f":"IF('Data Entry'!I3<>\"\",'Data Entry'!I3,\"\")","v":45},{"$f":"IF(SUM(C8:H8)<>0,SUM(C8:H8),\"\")","v":71},{"$f":"'Data Entry'!$J$103","v":44.551724137931032},null,null,null,null,null,""]
[2,{"$f":"IF('Data Entry'!B4<>0,'Data Entry'!B4,\"\")","v":"Anderski, Violet"},{"$f":"IF('Data Entry'!C4<>\"\",'Data Entry'!C4,\"\")","v":4},{"$f":"IF('Data Entry'!D4<>\"\",'Data Entry'!D4,\"\")","v":3},{"$f":"IF('Data Entry'!E4<>\"\",'Data Entry'!E4,\"\")","v":3},{"$f":"IF('Data Entry'!F4<>\"\",'Data Entry'!F4,\"\")","v":2},{"$f":"IF('Data Entry'!H4<>\"\",'Data Entry'!H4,\"\")","v":8},{"$f":"IF('Data Entry'!I4<>\"\",'Data Entry'!I4,\"\")","v":33},{"$f":"IF(SUM(C9:H9)<>0,SUM(C9:H9),\"\")","v":53},{"$f":"'Data Entry'!$J$103","v":44.551724137931032},null,null,null,null,null,""]
[3,{"$f":"IF('Data Entry'!B5<>0,'Data Entry'!B5,\"\")","v":"Actara, Belle"},{"$f":"IF('Data Entry'!C5<>\"\",'Data Entry'!C5,\"\")","v":2},{"$f":"IF('Data Entry'!D5<>\"\",'Data Entry'!D5,\"\")","v":2},{"$f":"IF('Data Entry'!E5<>\"\",'Data Entry'!E5,\"\")","v":1},{"$f":"IF('Data Entry'!F5<>\"\",'Data Entry'!F5,\"\")","v":0},{"$f":"IF('Data Entry'!H5<>\"\",'Data Entry'!H5,\"\")","v":3},{"$f":"IF('Data Entry'!I5<>\"\",'Data Entry'!I5,\"\")","v":2},{"$f":"IF(SUM(C10:H10)<>0,SUM(C10:H10),\"\")","v":10},{"$f":"'Data Entry'!$J$103","v":44.551724137931032},null,null,null,null,null,""]
[4,{"$f":"IF('Data Entry'!B6<>0,'Data Entry'!B6,\"\")","v":"Bandito, Nicole"},{"$f":"IF('Data Entry'!C6<>\"\",'Data Entry'!C6,\"\")","v":3},{"$f":"IF('Data Entry'!D6<>\"\",'Data Entry'!D6,\"\")","v":2},{"$f":"IF('Data Entry'!E6<>\"\",'Data Entry'!E6,\"\")","v":1},{"$f":"IF('Data Entry'!F6<>\"\",'Data Entry'!F6,\"\")","v":2},{"$f":"IF('Data Entry'!H6<>\"\",'Data Entry'!H6,\"\")","v":4},{"$f":"IF('Data Entry'!I6<>\"\",'Data Entry'!I6,\"\")","v":13},25,{"$f":"'Data Entry'!$J$103","v":44.551724137931032},null,null,null,null,null,""]
[5,{"$f":"IF('Data Entry'!B7<>0,'Data Entry'!B7,\"\")","v":"Capriano, Geno"},{"$f":"IF('Data Entry'!C7<>\"\",'Data Entry'!C7,\"\")","v":5},{"$f":"IF('Data Entry'!D7<>\"\",'Data Entry'!D7,\"\")","v":4},{"$f":"IF('Data Entry'!E7<>\"\",'Data Entry'!E7,\"\")","v":4},{"$f":"IF('Data Entry'!F7<>\"\",'Data Entry'!F7,\"\")","v":3},{"$f":"IF('Data Entry'!H7<>\"\",'Data Entry'!H7,\"\")","v":6},{"$f":"IF('Data Entry'!I7<>\"\",'Data Entry'!I7,\"\")","v":45},67,{"$f":"'Data Entry'!$J$103","v":44.551724137931032},null,null,null,null,null,"Hallenko, Pierce"]
[6,{"$f":"IF('Data Entry'!B8<>0,'Data Entry'!B8,\"\")","v":"Dweck, Kaori"},{"$f":"IF('Data Entry'!C8<>\"\",'Data Entry'!C8,\"\")","v":5},{"$f":"IF('Data Entry'!D8<>\"\",'Data Entry'!D8,\"\")","v":3},{"$f":"IF('Data Entry'!E8<>\"\",'Data Entry'!E8,\"\")","v":3},{"$f":"IF('Data Entry'!F8<>\"\",'Data Entry'!F8,\"\")","v":3},{"$f":"IF('Data Entry'!H8<>\"\",'Data Entry'!H8,\"\")","v":5},{"$f":"IF('Data Entry'!I8<>\"\",'Data Entry'!I8,\"\")","v":37},56,{"$f":"'Data Entry'!$J$103","v":44.551724137931032},null,null,null,null,null,""]
[7,{"$f":"IF('Data Entry'!B9<>0,'Data Entry'!B9,\"\")","v":"Essman, Cal"},{"$f":"IF('Data Entry'!C9<>\"\",'Data Entry'!C9,\"\")","v":3},{"$f":"IF('Data Entry'!D9<>\"\",'Data Entry'!D9,\"\")","v":2},{"$f":"IF('Data Entry'!E9<>\"\",'Data Entry'!E9,\"\")","v":2},{"$f":"IF('Data Entry'!F9<>\"\",'Data Entry'!F9,\"\")","v":1},{"$f":"IF('Data Entry'!H9<>\"\",'Data Entry'!H9,\"\")","v":8},{"$f":"IF('Data Entry'!I9<>\"\",'Data Entry'!I9,\"\")","v":30},46,{"$f":"'Data Entry'!$J$103","v":44.551724137931032},null,null,null,null,null,""]
[8,{"$f":"IF('Data Entry'!B10<>0,'Data Entry'!B10,\"\")","v":"Fast, Autumn"},{"$f":"IF('Data Entry'!C10<>\"\",'Data Entry'!C10,\"\")","v":5},{"$f":"IF('Data Entry'!D10<>\"\",'Data Entry'!D10,\"\")","v":4},{"$f":"IF('Data Entry'!E10<>\"\",'Data Entry'!E10,\"\")","v":3},{"$f":"IF('Data Entry'!F10<>\"\",'Data Entry'!F10,\"\")","v":2},{"$f":"IF('Data Entry'!H10<>\"\",'Data Entry'!H10,\"\")","v":6},{"$f":"IF('Data Entry'!I10<>\"\",'Data Entry'!I10,\"\")","v":41},61,{"$f":"'Data Entry'!$J$103","v":44.551724137931032},null,null,null,null,null,"Peterson, Carmen"]
[9,{"$f":"IF('Data Entry'!B11<>0,'Data Entry'!B11,\"\")","v":"Greenwall, Brayden"},{"$f":"IF('Data Entry'!C11<>\"\",'Data Entry'!C11,\"\")","v":5},{"$f":"IF('Data Entry'!D11<>\"\",'Data Entry'!D11,\"\")","v":5},{"$f":"IF('Data Entry'!E11<>\"\",'Data Entry'!E11,\"\")","v":4},{"$f":"IF('Data Entry'!F11<>\"\",'Data Entry'!F11,\"\")","v":4},{"$f":"IF('Data Entry'!H11<>\"\",'Data Entry'!H11,\"\")","v":8},{"$f":"IF('Data Entry'!I11<>\"\",'Data Entry'!I11,\"\")","v":40},66,{"$f":"'Data Entry'!$J$103","v":44.551724137931032},null,null,null,null,null,""]
[10,{"$f":"IF('Data Entry'!B12<>0,'Data Entry'!B12,\"\")","v":"Hallenko, Pierce"},{"$f":"IF('Data Entry'!C12<>\"\",'Data Entry'!C12,\"\")","v":2},{"$f":"IF('Data Entry'!D12<>\"\",'Data Entry'!D12,\"\")","v":2},{"$f":"IF('Data Entry'!E12<>\"\",'Data Entry'!E12,\"\")","v":0},{"$f":"IF('Data Entry'!F12<>\"\",'Data Entry'!F12,\"\")","v":2},{"$f":"IF('Data Entry'!H12<>\"\",'Data Entry'!H12,\"\")","v":4},{"$f":"IF('Data Entry'!I12<>\"\",'Data Entry'!I12,\"\")","v":9},19,{"$f":"'Data Entry'!$J$103","v":44.551724137931032},null,null,null,null,null,""]
[11,{"$f":"IF('Data Entry'!B13<>0,'Data Entry'!B13,\"\")","v":"Lowen, Hunter"},{"$f":"IF('Data Entry'!C13<>\"\",'Data Entry'!C13,\"\")","v":5},{"$f":"IF('Data Entry'!D13<>\"\",'Data Entry'!D13,\"\")","v":1},{"$f":"IF('Data Entry'!E13<>\"\",'Data Entry'!E13,\"\")","v":4},{"$f":"IF('Data Entry'!F13<>\"\",'Data Entry'!F13,\"\")","v":0},{"$f":"IF('Data Entry'!H13<>\"\",'Data Entry'!H13,\"\")","v":7},{"$f":"IF('Data Entry'!I13<>\"\",'Data Entry'!I13,\"\")","v":35},52,{"$f":"'Data Entry'!$J$103","v":44.551724137931032},null,null,null,null,null,""]
[12,{"$f":"IF('Data Entry'!B14<>0,'Data Entry'!B14,\"\")","v":"Marbel, Melody"},{"$f":"IF('Data Entry'!C14<>\"\",'Data Entry'!C14,\"\")","v":5},{"$f":"IF('Data Entry'!D14<>\"\",'Data Entry'!D14,\"\")","v":3},{"$f":"IF('Data Entry'!E14<>\"\",'Data Entry'!E14,\"\")","v":5},{"$f":"IF('Data Entry'!F14<>\"\",'Data Entry'!F14,\"\")","v":2},{"$f":"IF('Data Entry'!H14<>\"\",'Data Entry'!H14,\"\")","v":9},{"$f":"IF('Data Entry'!I14<>\"\",'Data Entry'!I14,\"\")","v":18},42,{"$f":"'Data Entry'!$J$103","v":44.551724137931032},null,null,null,null,null,""]
[13,{"$f":"IF('Data Entry'!B15<>0,'Data Entry'!B15,\"\")","v":"Peterson, Carmen"},{"$f":"IF('Data Entry'!C15<>\"\",'Data Entry'!C15,\"\")","v":3},{"$f":"IF('Data Entry'!D15<>\"\",'Data Entry'!D15,\"\")","v":1},{"$f":"IF('Data Entry'!E15<>\"\",'Data Entry'!E15,\"\")","v":0},{"$f":"IF('Data Entry'!F15<>\"\",'Data Entry'!F15,\"\")","v":0},{"$f":"IF('Data Entry'!H15<>\"\",'Data Entry'!H15,\"\")","v":4},{"$f":"IF('Data Entry'!I15<>\"\",'Data Entry'!I15,\"\")","v":9},17,{"$f":"'Data Entry'!$J$103","v":44.551724137931032},null,null,null,null,null,""]
[14,{"$f":"IF('Data Entry'!B16<>0,'Data Entry'!B16,\"\")","v":"Rice, Bruce"},{"$f":"IF('Data Entry'!C16<>\"\",'Data Entry'!C16,\"\")","v":2},{"$f":"IF('Data Entry'!D16<>\"\",'Data Entry'!D16,\"\")","v":1},{"$f":"IF('Data Entry'!E16<>\"\",'Data Entry'!E16,\"\")","v":0},{"$f":"IF('Data Entry'!F16<>\"\",'Data Entry'!F16,\"\")","v":0},{"$f":"IF('Data Entry'!H16<>\"\",'Data Entry'!H16,\"\")","v":8},{"$f":"IF('Data Entry'!I16<>\"\",'Data Entry'!I16,\"\")","v":33},44,{"$f":"'Data Entry'!$J$103","v":44.551724137931032},null,null,null,null,null,""]
[15,null,null,null,null,null,null,null,"",{"$f":"'Data Entry'!$J$103","v":44.551724137931032},null,null,null,null,null,""]
[16,null,null,null,null,null,null,null,"",{"$f":"'Data Entry'!$J$103","v":44.551724137931032},null,null,null,null,null,""]
[17,null,null,null,null,null,null,null,"",{"$f":"'Data Entry'!$J$103","v":44.551724137931032},null,null,null,null,null,{"$f":"21-COUNTBLANK(P3:P23)","v":4}]
[18,null,null,null,null,null,null,null,"",{"$f":"'Data Entry'!$J$103","v":44.551724137931032}]
[19,null,null,null,null,null,null,null,"",{"$f":"'Data Entry'!$J$103","v":44.551724137931032}]
[20,null,null,null,null,null,null,null,"",{"$f":"'Data Entry'!$J$103","v":44.551724137931032}]
[21,null,null,null,null,null,null,null,"",{"$f":"'Data Entry'!$J$103","v":44.551724137931032}]
[null,null,null,null,null,null,null,null,{"$f":"'Data Entry'!$J$103","v":44.551724137931032}]
[null,"No. of Highlighted cells ",{"$f":"COUNTIF(C8:C28,\"<\"&C7)","v":3},{"$f":"COUNTIF(D8:D28,\"<\"&D7)","v":3},{"$f":"COUNTIF(E8:E28,\"<\"&E7)","v":5},4,1,4,4]
[null,null,null,null,null,null,null,null,{"$f":"'Data Entry'!$J$103","v":44.551724137931032}]
[null,"% of Ss with Sig. Weaknesses ",{"$f":"C30/14*100","v":21.428571428571427},{"$f":"D30/14*100","v":21.428571428571427},35.714285714285715,28.571428571428569,{"$f":"G30/14*100","v":7.1428571428571423},{"$f":"H30/14*100","v":28.571428571428569},{"$f":"I30/14*100","v":28.571428571428569}]
[]
[null,"% Degree of Mastery for all Ss ",{"$f":"100-C32","v":78.571428571428569},{"$f":"100-D32","v":78.571428571428569},64.285714285714278,71.428571428571431,"N/A",{"$f":"100-H32","v":71.428571428571431},{"$f":"100-I32","v":71.428571428571431}]
[null,null,null,null,null,null,null,null,null,{"$f":"'Data Entry'!$J$103","v":44.551724137931032}]
[null,null,null,null,null,null,null,null,null,{"$f":"'Data Entry'!$J$103","v":44.551724137931032}]
[null,null,null,null,null,null,null,null,null,{"$f":"'Data Entry'!$J$103","v":44.551724137931032}]

{"sheet":"Class 2","index":4,"n_rows":37,"n_cols":16,"rows_kept":37,"cut":false,"hidden":false,"merged":[[2,0,6,0],[2,2,3,2],[2,3,3,3],[2,4,3,4],[2,5,3,5],[2,6,3,6],[2,7,3,7],[2,8,3,8],[0,2,0,5],[1,2,1,5]]}
[null,"Teacher: ","Jessica Bowlby"]
[null,"Grade: ","K2G",null,null,null,null,null,null,null,null,null,null,null,null,"At-Risk Students"]
["#",null,"Blending Syllables","Segmenting to Syllables","Blending Phonemes","Segmenting to Phonemes","Phonological Memory","Letter Naming Fluency","Grand  Total",null,null,null,null,null,null,{"$f":"IF(I8<$I$7,B8,\"\")","v":""}]
[null,null,null,null,null,null,null,null,null,null,null,null,null,null,null,""]
[null,null,{"$f":"'Data Entry'!$C$103","v":3.7011494252873565},{"$f":"'Data Entry'!$D$103","v":2.5402298850574714},{"$f":"'Data Entry'!E103","v":2.735632183908046},{"$f":"'Data Entry'!F103","v":1.9195402298850575},{"$f":"'Data Entry'!H103","v":5.5862068965517242},{"$f":"'Data Entry'!$I$103","v":28.068965517241381},{"$f":"'Data Entry'!J103","v":44.551724137931032},"Means",null,null,null,null,null,""]
[null,"Student",{"$f":"'Data Entry'!$C$104","v":1.0242971785427288},{"$f":"'Data Entry'!$D$104","v":0.99772529310018343},{"$f":"'Data Entry'!E104","v":1.2432119888356568},{"$f":"'Data Entry'!F104","v":0.93034615719093861},{"$f":"'Data Entry'!H104","v":1.9442923273958796},{"$f":"'Data Entry'!$I$104","v":11.760985071312451},{"$f":"'Data Entry'!J104","v":15.14331429783504},"Std. Devs.",null,null,null,null,null,"Demonslayer, Darryl"]
[null,"Names",{"$f":"C5-C6","v":2.6768522467446276},{"$f":"D5-D6","v":1.542504591957288},{"$f":"E5-E6","v":1.4924201950723892},0.98919407269411885,3.6419145691558445,16.30798044592893,{"$f":"I5-(I6)","v":29.408409840095992},"Cut-off Scores",null,null,null,null,null,"Hanson, Sawyer"]
[1,{"$f":"IF('Data Entry'!B17<>0,'Data Entry'!B17,\"\")","v":"Broman, Clara"},{"$f":"IF('Data Entry'!C17<>\"\",'Data Entry'!C17,\"\")","v":5},{"$f":"IF('Data Entry'!D17<>\"\",'Data Entry'!D17,\"\")","v":2},{"$f":"IF('Data Entry'!E17<>\"\",'Data Entry'!E17,\"\")","v":4},{"$f":"IF('Data Entry'!F17<>\"\",'Data Entry'!F17,\"\")","v":2},{"$f":"IF('Data Entry'!H17<>\"\",'Data Entry'!H17,\"\")","v":7},{"$f":"IF('Data Entry'!I17<>\"\",'Data Entry'!I17,\"\")","v":19},{"$f":"IF(SUM(C8:H8)<>0,SUM(C8:H8),\"\")","v":39},{"$f":"'Data Entry'!$J$103","v":44.551724137931032},null,null,null,null,null,""]
[2,{"$f":"IF('Data Entry'!B18<>0,'Data Entry'!B18,\"\")","v":"Catchy, Danny"},{"$f":"IF('Data Entry'!C18<>\"\",'Data Entry'!C18,\"\")","v":5},{"$f":"IF('Data Entry'!D18<>\"\",'Data Entry'!D18,\"\")","v":3},{"$f":"IF('Data Entry'!E18<>\"\",'Data Entry'!E18,\"\")","v":5},{"$f":"IF('Data Entry'!F18<>\"\",'Data Entry'!F18,\"\")","v":2},{"$f":"IF('Data Entry'!H18<>\"\",'Data Entry'!H18,\"\")","v":4},{"$f":"IF('Data Entry'!I18<>\"\",'Data Entry'!I18,\"\")","v":33},{"$f":"IF(SUM(C9:H9)<>0,SUM(C9:H9),\"\")","v":52},{"$f":"'Data Entry'!$J$103","v":44.551724137931032},null,null,null,null,null,""]
[3,{"$f":"IF('Data Entry'!B19<>0,'Data Entry'!B19,\"\")","v":"Cayburn, Karl"},{"$f":"IF('Data Entry'!C19<>\"\",'Data Entry'!C19,\"\")","v":4},{"$f":"IF('Data Entry'!D19<>\"\",'Data Entry'!D19,\"\")","v":3},{"$f":"IF('Data Entry'!E19<>\"\",'Data Entry'!E19,\"\")","v":4},{"$f":"IF('Data Entry'!F19<>\"\",'Data Entry'!F19,\"\")","v":3},{"$f":"IF('Data Entry'!H19<>\"\",'Data Entry'!H19,\"\")","v":7},{"$f":"IF('Data Entry'!I19<>\"\",'Data Entry'!I19,\"\")","v":36},{"$f":"IF(SUM(C10:H10)<>0,SUM(C10:H10),\"\")","v":57},{"$f":"'Data Entry'!$J$103","v":44.551724137931032},null,null,null,null,null,""]
[4,{"$f":"IF('Data Entry'!B20<>0,'Data Entry'!B20,\"\")","v":"Demonslayer, Darryl"},{"$f":"IF('Data Entry'!C20<>\"\",'Data Entry'!C20,\"\")","v":3},{"$f":"IF('Data Entry'!D20<>\"\",'Data Entry'!D20,\"\")","v":2},{"$f":"IF('Data Entry'!E20<>\"\",'Data Entry'!E20,\"\")","v":1},{"$f":"IF('Data Entry'!F20<>\"\",'Data Entry'!F20,\"\")","v":0},{"$f":"IF('Data Entry'!H20<>\"\",'Data Entry'!H20,\"\")","v":6},{"$f":"IF('Data Entry'!I20<>\"\",'Data Entry'!I20,\"\")","v":10},22,{"$f":"'Data Entry'!$J$103","v":44.551724137931032},null,null,null,null,null,"Lagensky, Patty"]
[5,{"$f":"IF('Data Entry'!B21<>0,'Data Entry'!B21,\"\")","v":"Hanson, Sawyer"},{"$f":"IF('Data Entry'!C21<>\"\",'Data Entry'!C21,\"\")","v":3},{"$f":"IF('Data Entry'!D21<>\"\",'Data Entry'!D21,\"\")","v":1},{"$f":"IF('Data Entry'!E21<>\"\",'Data Entry'!E21,\"\")","v":2},{"$f":"IF('Data Entry'!F21<>\"\",'Data Entry'!F21,\"\")","v":0},{"$f":"IF('Data Entry'!H21<>\"\",'Data Entry'!H21,\"\")","v":3},{"$f":"IF('Data Entry'!I21<>\"\",'Data Entry'!I21,\"\")","v":11},20,{"$f":"'Data Entry'!$J$103","v":44.551724137931032},null,null,null,null,null,"Lorrey, Fred"]
[6,{"$f":"IF('Data Entry'!B22<>0,'Data Entry'!B22,\"\")","v":"Hiebert, Bruce"},{"$f":"IF('Data Entry'!C22<>\"\",'Data Entry'!C22,\"\")","v":5},{"$f":"IF('Data Entry'!D22<>\"\",'Data Entry'!D22,\"\")","v":3},{"$f":"IF('Data Entry'!E22<>\"\",'Data Entry'!E22,\"\")","v":5},{"$f":"IF('Data Entry'!F22<>\"\",'Data Entry'!F22,\"\")","v":3},{"$f":"IF('Data Entry'!H22<>\"\",'Data Entry'!H22,\"\")","v":5},{"$f":"IF('Data Entry'!I22<>\"\",'Data Entry'!I22,\"\")","v":48},69,{"$f":"'Data Entry'!$J$103","v":44.551724137931032},null,null,null,null,null,""]
[7,{"$f":"IF('Data Entry'!B23<>0,'Data Entry'!B23,\"\")","v":"Heidelburg, Corby"},{"$f":"IF('Data Entry'!C23<>\"\",'Data Entry'!C23,\"\")","v":3},{"$f":"IF('Data Entry'!D23<>\"\",'Data Entry'!D23,\"\")","v":3},{"$f":"IF('Data Entry'!E23<>\"\",'Data Entry'!E23,\"\")","v":2},{"$f":"IF('Data Entry'!F23<>\"\",'Data Entry'!F23,\"\")","v":3},{"$f":"IF('Data Entry'!H23<>\"\",'Data Entry'!H23,\"\")","v":7},{"$f":"IF('Data Entry'!I23<>\"\",'Data Entry'!I23,\"\")","v":37},55,{"$f":"'Data Entry'!$J$103","v":44.551724137931032},null,null,null,null,null,""]
[8,{"$f":"IF('Data Entry'!B24<>0,'Data Entry'!B24,\"\")","v":"Krinkle, Luke"},{"$f":"IF('Data Entry'!C24<>\"\",'Data Entry'!C24,\"\")","v":2},{"$f":"IF('Data Entry'!D24<>\"\",'Data Entry'!D24,\"\")","v":2},{"$f":"IF('Data Entry'!E24<>\"\",'Data Entry'!E24,\"\")","v":2},{"$f":"IF('Data Entry'!F24<>\"\",'Data Entry'!F24,\"\")","v":1},{"$f":"IF('Data Entry'!H24<>\"\",'Data Entry'!H24,\"\")","v":4},{"$f":"IF('Data Entry'!I24<>\"\",'Data Entry'!I24,\"\")","v":23},34,{"$f":"'Data Entry'!$J$103","v":44.551724137931032},null,null,null,null,null,"Ohera, Marian"]
[9,{"$f":"IF('Data Entry'!B25<>0,'Data Entry'!B25,\"\")","v":"Lagensky, Patty"},{"$f":"IF('Data Entry'!C25<>\"\",'Data Entry'!C25,\"\")","v":3},{"$f":"IF('Data Entry'!D25<>\"\",'Data Entry'!D25,\"\")","v":0},{"$f":"IF('Data Entry'!E25<>\"\",'Data Entry'!E25,\"\")","v":1},{"$f":"IF('Data Entry'!F25<>\"\",'Data Entry'!F25,\"\")","v":1},{"$f":"IF('Data Entry'!H25<>\"\",'Data Entry'!H25,\"\")","v":3},{"$f":"IF('Data Entry'!I25<>\"\",'Data Entry'!I25,\"\")","v":12},20,{"$f":"'Data Entry'!$J$103","v":44.551724137931032},null,null,null,null,null,""]
[10,{"$f":"IF('Data Entry'!B26<>0,'Data Entry'!B26,\"\")","v":"Lorrey, Fred"},{"$f":"IF('Data Entry'!C26<>\"\",'Data Entry'!C26,\"\")","v":4},{"$f":"IF('Data Entry'!D26<>\"\",'Data Entry'!D26,\"\")","v":1},{"$f":"IF('Data Entry'!E26<>\"\",'Data Entry'!E26,\"\")","v":1},{"$f":"IF('Data Entry'!F26<>\"\",'Data Entry'!F26,\"\")","v":2},{"$f":"IF('Data Entry'!H26<>\"\",'Data Entry'!H26,\"\")","v":5},{"$f":"IF('Data Entry'!I26<>\"\",'Data Entry'!I26,\"\")","v":14},27,{"$f":"'Data Entry'!$J$103","v":44.551724137931032},null,null,null,null,null,"Sarbucker, Cassedy"]
[11,{"$f":"IF('Data Entry'!B27<>0,'Data Entry'!B27,\"\")","v":"Marvel, Captain"},{"$f":"IF('Data Entry'!C27<>\"\",'Data Entry'!C27,\"\")","v":3},{"$f":"IF('Data Entry'!D27<>\"\",'Data Entry'!D27,\"\")","v":2},{"$f":"IF('Data Entry'!E27<>\"\",'Data Entry'!E27,\"\")","v":2},{"$f":"IF('Data Entry'!F27<>\"\",'Data Entry'!F27,\"\")","v":2},{"$f":"IF('Data Entry'!H27<>\"\",'Data Entry'!H27,\"\")","v":4},{"$f":"IF('Data Entry'!I27<>\"\",'Data Entry'!I27,\"\")","v":24},37,{"$f":"'Data Entry'!$J$103","v":44.551724137931032},null,null,null,null,null,""]
[12,{"$f":"IF('Data Entry'!B28<>0,'Data Entry'!B28,\"\")","v":"Manswella, Rico"},{"$f":"IF('Data Entry'!C28<>\"\",'Data Entry'!C28,\"\")","v":3},{"$f":"IF('Data Entry'!D28<>\"\",'Data Entry'!D28,\"\")","v":2},{"$f":"IF('Data Entry'!E28<>\"\",'Data Entry'!E28,\"\")","v":3},{"$f":"IF('Data Entry'!F28<>\"\",'Data Entry'!F28,\"\")","v":1},{"$f":"IF('Data Entry'!H28<>\"\",'Data Entry'!H28,\"\")","v":7},{"$f":"IF('Data Entry'!I28<>\"\",'Data Entry'!I28,\"\")","v":34},50,{"$f":"'Data Entry'!$J$103","v":44.551724137931032},null,null,null,null,null,"Skaper, Leah"]
[13,{"$f":"IF('Data Entry'!B29<>0,'Data Entry'!B29,\"\")","v":"Ohera, Marian"},{"$f":"IF('Data Entry'!C29<>\"\",'Data Entry'!C29,\"\")","v":2},{"$f":"IF('Data Entry'!D29<>\"\",'Data Entry'!D29,\"\")","v":3},{"$f":"IF('Data Entry'!E29<>\"\",'Data Entry'!E29,\"\")","v":2},{"$f":"IF('Data Entry'!F29<>\"\",'Data Entry'!F29,\"\")","v":2},{"$f":"IF('Data Entry'!H29<>\"\",'Data Entry'!H29,\"\")","v":6},{"$f":"IF('Data Entry'!I29<>\"\",'Data Entry'!I29,\"\")","v":12},27,{"$f":"'Data Entry'!$J$103","v":44.551724137931032},null,null,null,null,null,"Shneider, Ingrid"]
[14,{"$f":"IF('Data Entry'!B30<>0,'Data Entry'!B30,\"\")","v":"Penner, Annie"},{"$f":"IF('Data Entry'!C30<>\"\",'Data Entry'!C30,\"\")","v":3},{"$f":"IF('Data Entry'!D30<>\"\",'Data Entry'!D30,\"\")","v":2},{"$f":"IF('Data Entry'!E30<>\"\",'Data Entry'!E30,\"\")","v":2},{"$f":"IF('Data Entry'!F30<>\"\",'Data Entry'!F30,\"\")","v":2},{"$f":"IF('Data Entry'!H30<>\"\",'Data Entry'!H30,\"\")","v":8},{"$f":"IF('Data Entry'!I30<>\"\",'Data Entry'!I30,\"\")","v":23},40,{"$f":"'Data Entry'!$J$103","v":44.551724137931032},null,null,null,null,null,""]
[15,{"$f":"IF('Data Entry'!B31<>0,'Data Entry'!B31,\"\")","v":"Sarbucker, Cassedy"},{"$f":"IF('Data Entry'!C31<>\"\",'Data Entry'!C31,\"\")","v":4},{"$f":"IF('Data Entry'!D31<>\"\",'Data Entry'!D31,\"\")","v":1},{"$f":"IF('Data Entry'!E31<>\"\",'Data Entry'!E31,\"\")","v":1},{"$f":"IF('Data Entry'!F31<>\"\",'Data Entry'!F31,\"\")","v":3},{"$f":"IF('Data Entry'!H31<>\"\",'Data Entry'!H31,\"\")","v":5},{"$f":"IF('Data Entry'!I31<>\"\",'Data Entry'!I31,\"\")","v":12},26,{"$f":"'Data Entry'!$J$103","v":44.551724137931032},null,null,null,null,null,""]
[16,{"$f":"IF('Data Entry'!B32<>0,'Data Entry'!B32,\"\")","v":"Schell, John"},{"$f":"IF('Data Entry'!C32<>\"\",'Data Entry'!C32,\"\")","v":4},{"$f":"IF('Data Entry'!D32<>\"\",'Data Entry'!D32,\"\")","v":2},{"$f":"IF('Data Entry'!E32<>\"\",'Data Entry'!E32,\"\")","v":2},{"$f":"IF('Data Entry'!F32<>\"\",'Data Entry'!F32,\"\")","v":2},{"$f":"IF('Data Entry'!H32<>\"\",'Data Entry'!H32,\"\")","v":6},{"$f":"IF('Data Entry'!I32<>\"\",'Data Entry'!I32,\"\")","v":23},39,{"$f":"'Data Entry'!$J$103","v":44.551724137931032},null,null,null,null,null,""]
[17,{"$f":"IF('Data Entry'!B33<>0,'Data Entry'!B33,\"\")","v":"Skaper, Leah"},{"$f":"IF('Data Entry'!C33<>\"\",'Data Entry'!C33,\"\")","v":3},{"$f":"IF('Data Entry'!D33<>\"\",'Data Entry'!D33,\"\")","v":3},{"$f":"IF('Data Entry'!E33<>\"\",'Data Entry'!E33,\"\")","v":2},{"$f":"IF('Data Entry'!F33<>\"\",'Data Entry'!F33,\"\")","v":1},{"$f":"IF('Data Entry'!H33<>\"\",'Data Entry'!H33,\"\")","v":4},{"$f":"IF('Data Entry'!I33<>\"\",'Data Entry'!I33,\"\")","v":11},24,{"$f":"'Data Entry'!$J$103","v":44.551724137931032},null,null,null,null,null,{"$f":"21-COUNTBLANK(P3:P23)","v":8}]
[18,{"$f":"IF('Data Entry'!B34<>0,'Data Entry'!B34,\"\")","v":"Shneider, Ingrid"},{"$f":"IF('Data Entry'!C34<>\"\",'Data Entry'!C34,\"\")","v":5},{"$f":"IF('Data Entry'!D34<>\"\",'Data Entry'!D34,\"\")","v":2},{"$f":"IF('Data Entry'!E34<>\"\",'Data Entry'!E34,\"\")","v":3},{"$f":"IF('Data Entry'!F34<>\"\",'Data Entry'!F34,\"\")","v":2},{"$f":"IF('Data Entry'!H34<>\"\",'Data Entry'!H34,\"\")","v":5},{"$f":"IF('Data Entry'!I34<>\"\",'Data Entry'!I34,\"\")","v":10},27,{"$f":"'Data Entry'!$J$103","v":44.551724137931032}]
[19,{"$f":"IF('Data Entry'!B35<>0,'Data Entry'!B35,\"\")","v":"klywalker, Eric"},{"$f":"IF('Data Entry'!C35<>\"\",'Data Entry'!C35,\"\")","v":4},{"$f":"IF('Data Entry'!D35<>\"\",'Data Entry'!D35,\"\")","v":4},{"$f":"IF('Data Entry'!E35<>\"\",'Data Entry'!E35,\"\")","v":4},{"$f":"IF('Data Entry'!F35<>\"\",'Data Entry'!F35,\"\")","v":3},{"$f":"IF('Data Entry'!H35<>\"\",'Data Entry'!H35,\"\")","v":6},{"$f":"IF('Data Entry'!I35<>\"\",'Data Entry'!I35,\"\")","v":22},43,{"$f":"'Data Entry'!$J$103","v":44.551724137931032}]
[20,{"$f":"IF('Data Entry'!B36<>0,'Data Entry'!B36,\"\")","v":"Voit, John"},{"$f":"IF('Data Entry'!C36<>\"\",'Data Entry'!C36,\"\")","v":3},{"$f":"IF('Data Entry'!D36<>\"\",'Data Entry'!D36,\"\")","v":3},{"$f":"IF('Data Entry'!E36<>\"\",'Data Entry'!E36,\"\")","v":3},{"$f":"IF('Data Entry'!F36<>\"\",'Data Entry'!F36,\"\")","v":3},{"$f":"IF('Data Entry'!H36<>\"\",'Data Entry'!H36,\"\")","v":3},{"$f":"IF('Data Entry'!I36<>\"\",'Data Entry'!I36,\"\")","v":32},47,{"$f":"'Data Entry'!$J$103","v":44.551724137931032}]
[21,null,null,null,null,null,null,null,"",{"$f":"'Data Entry'!$J$103","v":44.551724137931032}]
[null,null,null,null,null,null,null,null,{"$f":"'Data Entry'!$J$103","v":44.551724137931032}]
[null,"No. of Highlighted cells ",{"$f":"COUNTIF(C8:C28,\"<\"&C7)","v":2},{"$f":"COUNTIF(D8:D28,\"<\"&D7)","v":4},4,2,3,8,8]
[null,null,null,null,null,null,null,null,{"$f":"'Data Entry'!$J$103","v":44.551724137931032}]
[null,"% of Ss with Sig. Weaknesses ",{"$f":"C30/14*100","v":14.285714285714285},{"$f":"D30/14*100","v":28.571428571428569},28.571428571428569,14.285714285714285,{"$f":"G30/14*100","v":21.428571428571427},{"$f":"H30/14*100","v":57.142857142857139},{"$f":"I30/14*100","v":57.142857142857139}]
[]
[null,"% Degree of Mastery for all Ss ",{"$f":"100-C32","v":85.714285714285722},{"$f":"100-D32","v":71.428571428571431},71.428571428571431,85.714285714285722,"N/A",{"$f":"100-H32","v":42.857142857142861},{"$f":"100-I32","v":42.857142857142861}]
[null,null,null,null,null,null,null,null,null,{"$f":"'Data Entry'!$J$103","v":44.551724137931032}]
[null,null,null,null,null,null,null,null,null,{"$f":"'Data Entry'!$J$103","v":44.551724137931032}]
[null,null,null,null,null,null,null,null,null,{"$f":"'Data Entry'!$J$103","v":44.551724137931032}]

{"sheet":"Class 3","index":5,"n_rows":37,"n_cols":16,"rows_kept":37,"cut":false,"hidden":false,"merged":[[2,0,6,0],[2,2,3,2],[2,3,3,3],[2,4,3,4],[2,5,3,5],[2,6,3,6],[2,7,3,7],[2,8,3,8],[0,2,0,5],[1,2,1,5]]}
[null,"Teacher: ","Sheri Meyer"]
[null,"Grade: ","K3B",null,null,null,null,null,null,null,null,null,null,null,null,"At-Risk Students"]
["#",null,"Blending Syllables","Segmenting to Syllables","Blending Phonemes","Segmenting to Phonemes","Phonological Memory","Letter Naming Fluency","Grand  Total",null,null,null,null,null,null,{"$f":"IF(I8<$I$7,B8,\"\")","v":""}]
[null,null,null,null,null,null,null,null,null,null,null,null,null,null,null,"Dorito, Danny"]
[null,null,{"$f":"'Data Entry'!$C$103","v":3.7011494252873565},{"$f":"'Data Entry'!$D$103","v":2.5402298850574714},{"$f":"'Data Entry'!E103","v":2.735632183908046},{"$f":"'Data Entry'!F103","v":1.9195402298850575},{"$f":"'Data Entry'!H103","v":5.5862068965517242},{"$f":"'Data Entry'!$I$103","v":28.068965517241381},{"$f":"'Data Entry'!J103","v":44.551724137931032},"Means",null,null,null,null,null,""]
[null,"Student",{"$f":"'Data Entry'!$C$104","v":1.0242971785427288},{"$f":"'Data Entry'!$D$104","v":0.99772529310018343},{"$f":"'Data Entry'!E104","v":1.2432119888356568},{"$f":"'Data Entry'!F104","v":0.93034615719093861},{"$f":"'Data Entry'!H104","v":1.9442923273958796},{"$f":"'Data Entry'!$I$104","v":11.760985071312451},{"$f":"'Data Entry'!J104","v":15.14331429783504},"Std. Devs.",null,null,null,null,null,""]
[null,"Names",{"$f":"C5-C6","v":2.6768522467446276},{"$f":"D5-D6","v":1.542504591957288},{"$f":"E5-E6","v":1.4924201950723892},0.98919407269411885,3.6419145691558445,16.30798044592893,{"$f":"I5-(I6)","v":29.408409840095992},"Cut-off Scores",null,null,null,null,null,""]
[1,{"$f":"IF('Data Entry'!B37<>0,'Data Entry'!B37,\"\")","v":"Benito, Ester"},{"$f":"IF('Data Entry'!C37<>\"\",'Data Entry'!C37,\"\")","v":5},{"$f":"IF('Data Entry'!D37<>\"\",'Data Entry'!D37,\"\")","v":2},{"$f":"IF('Data Entry'!E37<>\"\",'Data Entry'!E37,\"\")","v":3},{"$f":"IF('Data Entry'!F37<>\"\",'Data Entry'!F37,\"\")","v":2},{"$f":"IF('Data Entry'!H37<>\"\",'Data Entry'!H37,\"\")","v":6},{"$f":"IF('Data Entry'!I37<>\"\",'Data Entry'!I37,\"\")","v":19},{"$f":"IF(SUM(C8:H8)<>0,SUM(C8:H8),\"\")","v":37},{"$f":"'Data Entry'!$J$103","v":44.551724137931032},null,null,null,null,null,""]
[2,{"$f":"IF('Data Entry'!B38<>0,'Data Entry'!B38,\"\")","v":"Dorito, Danny"},{"$f":"IF('Data Entry'!C38<>\"\",'Data Entry'!C38,\"\")","v":2},{"$f":"IF('Data Entry'!D38<>\"\",'Data Entry'!D38,\"\")","v":3},{"$f":"IF('Data Entry'!E38<>\"\",'Data Entry'!E38,\"\")","v":2},{"$f":"IF('Data Entry'!F38<>\"\",'Data Entry'!F38,\"\")","v":2},{"$f":"IF('Data Entry'!H38<>\"\",'Data Entry'!H38,\"\")","v":3},{"$f":"IF('Data Entry'!I38<>\"\",'Data Entry'!I38,\"\")","v":10},{"$f":"IF(SUM(C9:H9)<>0,SUM(C9:H9),\"\")","v":22},{"$f":"'Data Entry'!$J$103","v":44.551724137931032},null,null,null,null,null,""]
[3,{"$f":"IF('Data Entry'!B39<>0,'Data Entry'!B39,\"\")","v":"Friesen, Elaine"},{"$f":"IF('Data Entry'!C39<>\"\",'Data Entry'!C39,\"\")","v":4},{"$f":"IF('Data Entry'!D39<>\"\",'Data Entry'!D39,\"\")","v":3},{"$f":"IF('Data Entry'!E39<>\"\",'Data Entry'!E39,\"\")","v":3},{"$f":"IF('Data Entry'!F39<>\"\",'Data Entry'!F39,\"\")","v":3},{"$f":"IF('Data Entry'!H39<>\"\",'Data Entry'!H39,\"\")","v":8},{"$f":"IF('Data Entry'!I39<>\"\",'Data Entry'!I39,\"\")","v":38},{"$f":"IF(SUM(C10:H10)<>0,SUM(C10:H10),\"\")","v":59},{"$f":"'Data Entry'!$J$103","v":44.551724137931032},null,null,null,null,null,""]
[4,{"$f":"IF('Data Entry'!B40<>0,'Data Entry'!B40,\"\")","v":"Fronk, Clara"},{"$f":"IF('Data Entry'!C40<>\"\",'Data Entry'!C40,\"\")","v":2},{"$f":"IF('Data Entry'!D40<>\"\",'Data Entry'!D40,\"\")","v":3},{"$f":"IF('Data Entry'!E40<>\"\",'Data Entry'!E40,\"\")","v":3},{"$f":"IF('Data Entry'!F40<>\"\",'Data Entry'!F40,\"\")","v":2},{"$f":"IF('Data Entry'!H40<>\"\",'Data Entry'!H40,\"\")","v":4},{"$f":"IF('Data Entry'!I40<>\"\",'Data Entry'!I40,\"\")","v":45},59,{"$f":"'Data Entry'!$J$103","v":44.551724137931032},null,null,null,null,null,""]
[5,{"$f":"IF('Data Entry'!B41<>0,'Data Entry'!B41,\"\")","v":"Gillingham, Teddy"},{"$f":"IF('Data Entry'!C41<>\"\",'Data Entry'!C41,\"\")","v":5},{"$f":"IF('Data Entry'!D41<>\"\",'Data Entry'!D41,\"\")","v":4},{"$f":"IF('Data Entry'!E41<>\"\",'Data Entry'!E41,\"\")","v":3},{"$f":"IF('Data Entry'!F41<>\"\",'Data Entry'!F41,\"\")","v":2},{"$f":"IF('Data Entry'!H41<>\"\",'Data Entry'!H41,\"\")","v":3},{"$f":"IF('Data Entry'!I41<>\"\",'Data Entry'!I41,\"\")","v":23},40,{"$f":"'Data Entry'!$J$103","v":44.551724137931032},null,null,null,null,null,""]
[6,{"$f":"IF('Data Entry'!B42<>0,'Data Entry'!B42,\"\")","v":"Harder, Hellen"},{"$f":"IF('Data Entry'!C42<>\"\",'Data Entry'!C42,\"\")","v":4},{"$f":"IF('Data Entry'!D42<>\"\",'Data Entry'!D42,\"\")","v":2},{"$f":"IF('Data Entry'!E42<>\"\",'Data Entry'!E42,\"\")","v":3},{"$f":"IF('Data Entry'!F42<>\"\",'Data Entry'!F42,\"\")","v":2},{"$f":"IF('Data Entry'!H42<>\"\",'Data Entry'!H42,\"\")","v":3},{"$f":"IF('Data Entry'!I42<>\"\",'Data Entry'!I42,\"\")","v":44},58,{"$f":"'Data Entry'!$J$103","v":44.551724137931032},null,null,null,null,null,""]
[7,{"$f":"IF('Data Entry'!B43<>0,'Data Entry'!B43,\"\")","v":"Heinrichs, Audrey"},{"$f":"IF('Data Entry'!C43<>\"\",'Data Entry'!C43,\"\")","v":4},{"$f":"IF('Data Entry'!D43<>\"\",'Data Entry'!D43,\"\")","v":3},{"$f":"IF('Data Entry'!E43<>\"\",'Data Entry'!E43,\"\")","v":2},{"$f":"IF('Data Entry'!F43<>\"\",'Data Entry'!F43,\"\")","v":1},{"$f":"IF('Data Entry'!H43<>\"\",'Data Entry'!H43,\"\")","v":4},{"$f":"IF('Data Entry'!I43<>\"\",'Data Entry'!I43,\"\")","v":35},49,{"$f":"'Data Entry'!$J$103","v":44.551724137931032},null,null,null,null,null,""]
[8,{"$f":"IF('Data Entry'!B44<>0,'Data Entry'!B44,\"\")","v":"Hofmann, Joan"},{"$f":"IF('Data Entry'!C44<>\"\",'Data Entry'!C44,\"\")","v":4},{"$f":"IF('Data Entry'!D44<>\"\",'Data Entry'!D44,\"\")","v":4},{"$f":"IF('Data Entry'!E44<>\"\",'Data Entry'!E44,\"\")","v":4},{"$f":"IF('Data Entry'!F44<>\"\",'Data Entry'!F44,\"\")","v":1},{"$f":"IF('Data Entry'!H44<>\"\",'Data Entry'!H44,\"\")","v":8},{"$f":"IF('Data Entry'!I44<>\"\",'Data Entry'!I44,\"\")","v":48},69,{"$f":"'Data Entry'!$J$103","v":44.551724137931032},null,null,null,null,null,""]
[9,{"$f":"IF('Data Entry'!B45<>0,'Data Entry'!B45,\"\")","v":"Klippenstein, Joey"},{"$f":"IF('Data Entry'!C45<>\"\",'Data Entry'!C45,\"\")","v":3},{"$f":"IF('Data Entry'!D45<>\"\",'Data Entry'!D45,\"\")","v":3},{"$f":"IF('Data Entry'!E45<>\"\",'Data Entry'!E45,\"\")","v":4},{"$f":"IF('Data Entry'!F45<>\"\",'Data Entry'!F45,\"\")","v":2},{"$f":"IF('Data Entry'!H45<>\"\",'Data Entry'!H45,\"\")","v":7},{"$f":"IF('Data Entry'!I45<>\"\",'Data Entry'!I45,\"\")","v":35},54,{"$f":"'Data Entry'!$J$103","v":44.551724137931032},null,null,null,null,null,""]
[10,{"$f":"IF('Data Entry'!B46<>0,'Data Entry'!B46,\"\")","v":"Kolair, Henry"},{"$f":"IF('Data Entry'!C46<>\"\",'Data Entry'!C46,\"\")","v":5},{"$f":"IF('Data Entry'!D46<>\"\",'Data Entry'!D46,\"\")","v":3},{"$f":"IF('Data Entry'!E46<>\"\",'Data Entry'!E46,\"\")","v":5},{"$f":"IF('Data Entry'!F46<>\"\",'Data Entry'!F46,\"\")","v":2},{"$f":"IF('Data Entry'!H46<>\"\",'Data Entry'!H46,\"\")","v":8},{"$f":"IF('Data Entry'!I46<>\"\",'Data Entry'!I46,\"\")","v":42},65,{"$f":"'Data Entry'!$J$103","v":44.551724137931032},null,null,null,null,null,""]
[11,{"$f":"IF('Data Entry'!B47<>0,'Data Entry'!B47,\"\")","v":"Marquette, Ryan"},{"$f":"IF('Data Entry'!C47<>\"\",'Data Entry'!C47,\"\")","v":5},{"$f":"IF('Data Entry'!D47<>\"\",'Data Entry'!D47,\"\")","v":3},{"$f":"IF('Data Entry'!E47<>\"\",'Data Entry'!E47,\"\")","v":3},{"$f":"IF('Data Entry'!F47<>\"\",'Data Entry'!F47,\"\")","v":2},{"$f":"IF('Data Entry'!H47<>\"\",'Data Entry'!H47,\"\")","v":7},{"$f":"IF('Data Entry'!I47<>\"\",'Data Entry'!I47,\"\")","v":41},61,{"$f":"'Data Entry'!$J$103","v":44.551724137931032},null,null,null,null,null,""]
[12,{"$f":"IF('Data Entry'!B48<>0,'Data Entry'!B48,\"\")","v":"Martin, Katie"},{"$f":"IF('Data Entry'!C48<>\"\",'Data Entry'!C48,\"\")","v":4},{"$f":"IF('Data Entry'!D48<>\"\",'Data Entry'!D48,\"\")","v":4},{"$f":"IF('Data Entry'!E48<>\"\",'Data Entry'!E48,\"\")","v":4},{"$f":"IF('Data Entry'!F48<>\"\",'Data Entry'!F48,\"\")","v":3},{"$f":"IF('Data Entry'!H48<>\"\",'Data Entry'!H48,\"\")","v":8},{"$f":"IF('Data Entry'!I48<>\"\",'Data Entry'!I48,\"\")","v":47},70,{"$f":"'Data Entry'!$J$103","v":44.551724137931032},null,null,null,null,null,""]
[13,{"$f":"IF('Data Entry'!B49<>0,'Data Entry'!B49,\"\")","v":"Mutch, Jayden"},{"$f":"IF('Data Entry'!C49<>\"\",'Data Entry'!C49,\"\")","v":3},{"$f":"IF('Data Entry'!D49<>\"\",'Data Entry'!D49,\"\")","v":2},{"$f":"IF('Data Entry'!E49<>\"\",'Data Entry'!E49,\"\")","v":2},{"$f":"IF('Data Entry'!F49<>\"\",'Data Entry'!F49,\"\")","v":2},{"$f":"IF('Data Entry'!H49<>\"\",'Data Entry'!H49,\"\")","v":6},{"$f":"IF('Data Entry'!I49<>\"\",'Data Entry'!I49,\"\")","v":32},47,{"$f":"'Data Entry'!$J$103","v":44.551724137931032},null,null,null,null,null,""]
[14,{"$f":"IF('Data Entry'!B50<>0,'Data Entry'!B50,\"\")","v":"Penner, Robert"},{"$f":"IF('Data Entry'!C50<>\"\",'Data Entry'!C50,\"\")","v":4},{"$f":"IF('Data Entry'!D50<>\"\",'Data Entry'!D50,\"\")","v":2},{"$f":"IF('Data Entry'!E50<>\"\",'Data Entry'!E50,\"\")","v":3},{"$f":"IF('Data Entry'!F50<>\"\",'Data Entry'!F50,\"\")","v":3},{"$f":"IF('Data Entry'!H50<>\"\",'Data Entry'!H50,\"\")","v":7},{"$f":"IF('Data Entry'!I50<>\"\",'Data Entry'!I50,\"\")","v":39},58,{"$f":"'Data Entry'!$J$103","v":44.551724137931032},null,null,null,null,null,""]
[15,{"$f":"IF('Data Entry'!B51<>0,'Data Entry'!B51,\"\")","v":"Schultz, Mario"},{"$f":"IF('Data Entry'!C51<>\"\",'Data Entry'!C51,\"\")","v":2},{"$f":"IF('Data Entry'!D51<>\"\",'Data Entry'!D51,\"\")","v":1},{"$f":"IF('Data Entry'!E51<>\"\",'Data Entry'!E51,\"\")","v":3},{"$f":"IF('Data Entry'!F51<>\"\",'Data Entry'!F51,\"\")","v":3},{"$f":"IF('Data Entry'!H51<>\"\",'Data Entry'!H51,\"\")","v":5},{"$f":"IF('Data Entry'!I51<>\"\",'Data Entry'!I51,\"\")","v":33},47,{"$f":"'Data Entry'!$J$103","v":44.551724137931032},null,null,null,null,null,""]
[16,{"$f":"IF('Data Entry'!B52<>0,'Data Entry'!B52,\"\")","v":"Smith, Abby"},{"$f":"IF('Data Entry'!C52<>\"\",'Data Entry'!C52,\"\")","v":4},{"$f":"IF('Data Entry'!D52<>\"\",'Data Entry'!D52,\"\")","v":3},{"$f":"IF('Data Entry'!E52<>\"\",'Data Entry'!E52,\"\")","v":4},{"$f":"IF('Data Entry'!F52<>\"\",'Data Entry'!F52,\"\")","v":2},{"$f":"IF('Data Entry'!H52<>\"\",'Data Entry'!H52,\"\")","v":5},{"$f":"IF('Data Entry'!I52<>\"\",'Data Entry'!I52,\"\")","v":37},55,{"$f":"'Data Entry'!$J$103","v":44.551724137931032},null,null,null,null,null,""]
[17,{"$f":"IF('Data Entry'!B53<>0,'Data Entry'!B53,\"\")","v":"Vogt, Adelle"},{"$f":"IF('Data Entry'!C53<>\"\",'Data Entry'!C53,\"\")","v":4},{"$f":"IF('Data Entry'!D53<>\"\",'Data Entry'!D53,\"\")","v":2},{"$f":"IF('Data Entry'!E53<>\"\",'Data Entry'!E53,\"\")","v":4},{"$f":"IF('Data Entry'!F53<>\"\",'Data Entry'!F53,\"\")","v":3},{"$f":"IF('Data Entry'!H53<>\"\",'Data Entry'!H53,\"\")","v":7},{"$f":"IF('Data Entry'!I53<>\"\",'Data Entry'!I53,\"\")","v":42},62,{"$f":"'Data Entry'!$J$103","v":44.551724137931032},null,null,null,null,null,{"$f":"21-COUNTBLANK(P3:P23)","v":1}]
[18,{"$f":"IF('Data Entry'!B54<>0,'Data Entry'!B54,\"\")","v":"Zilberman, Toni"},{"$f":"IF('Data Entry'!C54<>\"\",'Data Entry'!C54,\"\")","v":3},{"$f":"IF('Data Entry'!D54<>\"\",'Data Entry'!D54,\"\")","v":3},{"$f":"IF('Data Entry'!E54<>\"\",'Data Entry'!E54,\"\")","v":5},{"$f":"IF('Data Entry'!F54<>\"\",'Data Entry'!F54,\"\")","v":2},{"$f":"IF('Data Entry'!H54<>\"\",'Data Entry'!H54,\"\")","v":6},{"$f":"IF('Data Entry'!I54<>\"\",'Data Entry'!I54,\"\")","v":23},42,{"$f":"'Data Entry'!$J$103","v":44.551724137931032}]
[19,null,null,null,null,null,null,null,"",{"$f":"'Data Entry'!$J$103","v":44.551724137931032}]
[20,null,null,null,null,null,null,null,"",{"$f":"'Data Entry'!$J$103","v":44.551724137931032}]
[21,null,null,null,null,null,null,null,"",{"$f":"'Data Entry'!$J$103","v":44.551724137931032}]
[null,null,null,null,null,null,null,null,{"$f":"'Data Entry'!$J$103","v":44.551724137931032}]
[null,"No. of Highlighted cells ",{"$f":"COUNTIF(C8:C28,\"<\"&C7)","v":3},{"$f":"COUNTIF(D8:D28,\"<\"&D7)","v":1},0,0,3,1,1]
[null,null,null,null,null,null,null,null,{"$f":"'Data Entry'!$J$103","v":44.551724137931032}]
[null,"% of Ss with Sig. Weaknesses ",{"$f":"C30/14*100","v":21.428571428571427},{"$f":"D30/14*100","v":7.1428571428571423},0,0,{"$f":"G30/14*100","v":21.428571428571427},{"$f":"H30/14*100","v":7.1428571428571423},{"$f":"I30/14*100","v":7.1428571428571423}]
[]
[null,"% Degree of Mastery for all Ss ",{"$f":"100-C32","v":78.571428571428569},{"$f":"100-D32","v":92.857142857142861},100,100,"N/A",{"$f":"100-H32","v":92.857142857142861},{"$f":"100-I32","v":92.857142857142861}]
[null,null,null,null,null,null,null,null,null,{"$f":"'Data Entry'!$J$103","v":44.551724137931032}]
[null,null,null,null,null,null,null,null,null,{"$f":"'Data Entry'!$J$103","v":44.551724137931032}]
[null,null,null,null,null,null,null,null,null,{"$f":"'Data Entry'!$J$103","v":44.551724137931032}]

{"sheet":"Class 4","index":6,"n_rows":37,"n_cols":16,"rows_kept":37,"cut":false,"hidden":false,"merged":[[2,0,6,0],[2,2,3,2],[2,3,3,3],[2,4,3,4],[2,5,3,5],[2,6,3,6],[2,7,3,7],[2,8,3,8],[0,2,0,5],[1,2,1,5]]}
[null,"Teacher: ","Linda Kossman"]
[null,"Grade: ","K4C",null,null,null,null,null,null,null,null,null,null,null,null,"At-Risk Students"]
["#",null,"Blending Syllables","Segmenting to Syllables","Blending Phonemes","Segmenting to Phonemes","Phonological Memory","Letter Naming Fluency","Grand  Total",null,null,null,null,null,null,{"$f":"IF(I8<$I$7,B8,\"\")","v":""}]
[null,null,null,null,null,null,null,null,null,null,null,null,null,null,null,""]
[null,null,{"$f":"'Data Entry'!$C$103","v":3.7011494252873565},{"$f":"'Data Entry'!$D$103","v":2.5402298850574714},{"$f":"'Data Entry'!E103","v":2.735632183908046},{"$f":"'Data Entry'!F103","v":1.9195402298850575},{"$f":"'Data Entry'!H103","v":5.5862068965517242},{"$f":"'Data Entry'!$I$103","v":28.068965517241381},{"$f":"'Data Entry'!J103","v":44.551724137931032},"Means",null,null,null,null,null,"Bugeate, Moreen"]
[null,"Student",{"$f":"'Data Entry'!$C$104","v":1.0242971785427288},{"$f":"'Data Entry'!$D$104","v":0.99772529310018343},{"$f":"'Data Entry'!E104","v":1.2432119888356568},{"$f":"'Data Entry'!F104","v":0.93034615719093861},{"$f":"'Data Entry'!H104","v":1.9442923273958796},{"$f":"'Data Entry'!$I$104","v":11.760985071312451},{"$f":"'Data Entry'!J104","v":15.14331429783504},"Std. Devs.",null,null,null,null,null,""]
[null,"Names",{"$f":"C5-C6","v":2.6768522467446276},{"$f":"D5-D6","v":1.542504591957288},{"$f":"E5-E6","v":1.4924201950723892},0.98919407269411885,3.6419145691558445,16.30798044592893,{"$f":"I5-(I6)","v":29.408409840095992},"Cut-off Scores",null,null,null,null,null,""]
[1,{"$f":"IF('Data Entry'!B55<>0,'Data Entry'!B55,\"\")","v":"Ardene, Mary"},{"$f":"IF('Data Entry'!C55<>\"\",'Data Entry'!C55,\"\")","v":4},{"$f":"IF('Data Entry'!D55<>\"\",'Data Entry'!D55,\"\")","v":2},{"$f":"IF('Data Entry'!E55<>\"\",'Data Entry'!E55,\"\")","v":4},{"$f":"IF('Data Entry'!F55<>\"\",'Data Entry'!F55,\"\")","v":2},{"$f":"IF('Data Entry'!H55<>\"\",'Data Entry'!H55,\"\")","v":6},{"$f":"IF('Data Entry'!I55<>\"\",'Data Entry'!I55,\"\")","v":35},{"$f":"IF(SUM(C8:H8)<>0,SUM(C8:H8),\"\")","v":53},{"$f":"'Data Entry'!$J$103","v":44.551724137931032},null,null,null,null,null,""]
[2,{"$f":"IF('Data Entry'!B56<>0,'Data Entry'!B56,\"\")","v":"Brother, Peter"},{"$f":"IF('Data Entry'!C56<>\"\",'Data Entry'!C56,\"\")","v":5},{"$f":"IF('Data Entry'!D56<>\"\",'Data Entry'!D56,\"\")","v":3},{"$f":"IF('Data Entry'!E56<>\"\",'Data Entry'!E56,\"\")","v":5},{"$f":"IF('Data Entry'!F56<>\"\",'Data Entry'!F56,\"\")","v":2},{"$f":"IF('Data Entry'!H56<>\"\",'Data Entry'!H56,\"\")","v":8},{"$f":"IF('Data Entry'!I56<>\"\",'Data Entry'!I56,\"\")","v":39},{"$f":"IF(SUM(C9:H9)<>0,SUM(C9:H9),\"\")","v":62},{"$f":"'Data Entry'!$J$103","v":44.551724137931032},null,null,null,null,null,""]
[3,{"$f":"IF('Data Entry'!B57<>0,'Data Entry'!B57,\"\")","v":"Bugeate, Moreen"},{"$f":"IF('Data Entry'!C57<>\"\",'Data Entry'!C57,\"\")","v":2},{"$f":"IF('Data Entry'!D57<>\"\",'Data Entry'!D57,\"\")","v":1},{"$f":"IF('Data Entry'!E57<>\"\",'Data Entry'!E57,\"\")","v":2},{"$f":"IF('Data Entry'!F57<>\"\",'Data Entry'!F57,\"\")","v":1},{"$f":"IF('Data Entry'!H57<>\"\",'Data Entry'!H57,\"\")","v":2},{"$f":"IF('Data Entry'!I57<>\"\",'Data Entry'!I57,\"\")","v":12},{"$f":"IF(SUM(C10:H10)<>0,SUM(C10:H10),\"\")","v":20},{"$f":"'Data Entry'!$J$103","v":44.551724137931032},null,null,null,null,null,""]
[4,{"$f":"IF('Data Entry'!B58<>0,'Data Entry'!B58,\"\")","v":"Candy, William"},{"$f":"IF('Data Entry'!C58<>\"\",'Data Entry'!C58,\"\")","v":4},{"$f":"IF('Data Entry'!D58<>\"\",'Data Entry'!D58,\"\")","v":2},{"$f":"IF('Data Entry'!E58<>\"\",'Data Entry'!E58,\"\")","v":2},{"$f":"IF('Data Entry'!F58<>\"\",'Data Entry'!F58,\"\")","v":2},{"$f":"IF('Data Entry'!H58<>\"\",'Data Entry'!H58,\"\")","v":5},{"$f":"IF('Data Entry'!I58<>\"\",'Data Entry'!I58,\"\")","v":34},49,{"$f":"'Data Entry'!$J$103","v":44.551724137931032},null,null,null,null,null,""]
[5,{"$f":"IF('Data Entry'!B59<>0,'Data Entry'!B59,\"\")","v":"Dyck, Teddy"},{"$f":"IF('Data Entry'!C59<>\"\",'Data Entry'!C59,\"\")","v":4},{"$f":"IF('Data Entry'!D59<>\"\",'Data Entry'!D59,\"\")","v":2},{"$f":"IF('Data Entry'!E59<>\"\",'Data Entry'!E59,\"\")","v":2},{"$f":"IF('Data Entry'!F59<>\"\",'Data Entry'!F59,\"\")","v":2},{"$f":"IF('Data Entry'!H59<>\"\",'Data Entry'!H59,\"\")","v":5},{"$f":"IF('Data Entry'!I59<>\"\",'Data Entry'!I59,\"\")","v":23},38,{"$f":"'Data Entry'!$J$103","v":44.551724137931032},null,null,null,null,null,""]
[6,{"$f":"IF('Data Entry'!B60<>0,'Data Entry'!B60,\"\")","v":"Hudson, Harriette"},{"$f":"IF('Data Entry'!C60<>\"\",'Data Entry'!C60,\"\")","v":5},{"$f":"IF('Data Entry'!D60<>\"\",'Data Entry'!D60,\"\")","v":2},{"$f":"IF('Data Entry'!E60<>\"\",'Data Entry'!E60,\"\")","v":3},{"$f":"IF('Data Entry'!F60<>\"\",'Data Entry'!F60,\"\")","v":1},{"$f":"IF('Data Entry'!H60<>\"\",'Data Entry'!H60,\"\")","v":4},{"$f":"IF('Data Entry'!I60<>\"\",'Data Entry'!I60,\"\")","v":43},58,{"$f":"'Data Entry'!$J$103","v":44.551724137931032},null,null,null,null,null,""]
[7,{"$f":"IF('Data Entry'!B61<>0,'Data Entry'!B61,\"\")","v":"Messia, Penny"},{"$f":"IF('Data Entry'!C61<>\"\",'Data Entry'!C61,\"\")","v":5},{"$f":"IF('Data Entry'!D61<>\"\",'Data Entry'!D61,\"\")","v":3},{"$f":"IF('Data Entry'!E61<>\"\",'Data Entry'!E61,\"\")","v":3},{"$f":"IF('Data Entry'!F61<>\"\",'Data Entry'!F61,\"\")","v":2},{"$f":"IF('Data Entry'!H61<>\"\",'Data Entry'!H61,\"\")","v":7},{"$f":"IF('Data Entry'!I61<>\"\",'Data Entry'!I61,\"\")","v":28},48,{"$f":"'Data Entry'!$J$103","v":44.551724137931032},null,null,null,null,null,""]
[8,{"$f":"IF('Data Entry'!B62<>0,'Data Entry'!B62,\"\")","v":"Penner, Elaine"},{"$f":"IF('Data Entry'!C62<>\"\",'Data Entry'!C62,\"\")","v":3},{"$f":"IF('Data Entry'!D62<>\"\",'Data Entry'!D62,\"\")","v":3},{"$f":"IF('Data Entry'!E62<>\"\",'Data Entry'!E62,\"\")","v":2},{"$f":"IF('Data Entry'!F62<>\"\",'Data Entry'!F62,\"\")","v":2},{"$f":"IF('Data Entry'!H62<>\"\",'Data Entry'!H62,\"\")","v":8},{"$f":"IF('Data Entry'!I62<>\"\",'Data Entry'!I62,\"\")","v":44},62,{"$f":"'Data Entry'!$J$103","v":44.551724137931032},null,null,null,null,null,""]
[9,{"$f":"IF('Data Entry'!B63<>0,'Data Entry'!B63,\"\")","v":"Rajooley, Anna"},{"$f":"IF('Data Entry'!C63<>\"\",'Data Entry'!C63,\"\")","v":3},{"$f":"IF('Data Entry'!D63<>\"\",'Data Entry'!D63,\"\")","v":4},{"$f":"IF('Data Entry'!E63<>\"\",'Data Entry'!E63,\"\")","v":4},{"$f":"IF('Data Entry'!F63<>\"\",'Data Entry'!F63,\"\")","v":3},{"$f":"IF('Data Entry'!H63<>\"\",'Data Entry'!H63,\"\")","v":7},{"$f":"IF('Data Entry'!I63<>\"\",'Data Entry'!I63,\"\")","v":21},42,{"$f":"'Data Entry'!$J$103","v":44.551724137931032},null,null,null,null,null,""]
[10,{"$f":"IF('Data Entry'!B64<>0,'Data Entry'!B64,\"\")","v":"Renzulli, Leah"},{"$f":"IF('Data Entry'!C64<>\"\",'Data Entry'!C64,\"\")","v":4},{"$f":"IF('Data Entry'!D64<>\"\",'Data Entry'!D64,\"\")","v":4},{"$f":"IF('Data Entry'!E64<>\"\",'Data Entry'!E64,\"\")","v":3},{"$f":"IF('Data Entry'!F64<>\"\",'Data Entry'!F64,\"\")","v":2},{"$f":"IF('Data Entry'!H64<>\"\",'Data Entry'!H64,\"\")","v":7},{"$f":"IF('Data Entry'!I64<>\"\",'Data Entry'!I64,\"\")","v":18},38,{"$f":"'Data Entry'!$J$103","v":44.551724137931032},null,null,null,null,null,""]
[11,{"$f":"IF('Data Entry'!B65<>0,'Data Entry'!B65,\"\")","v":"Roxmeyer, Zoey"},{"$f":"IF('Data Entry'!C65<>\"\",'Data Entry'!C65,\"\")","v":2},{"$f":"IF('Data Entry'!D65<>\"\",'Data Entry'!D65,\"\")","v":3},{"$f":"IF('Data Entry'!E65<>\"\",'Data Entry'!E65,\"\")","v":3},{"$f":"IF('Data Entry'!F65<>\"\",'Data Entry'!F65,\"\")","v":3},{"$f":"IF('Data Entry'!H65<>\"\",'Data Entry'!H65,\"\")","v":6},{"$f":"IF('Data Entry'!I65<>\"\",'Data Entry'!I65,\"\")","v":32},49,{"$f":"'Data Entry'!$J$103","v":44.551724137931032},null,null,null,null,null,""]
[12,{"$f":"IF('Data Entry'!B66<>0,'Data Entry'!B66,\"\")","v":"Sailing, Mark"},{"$f":"IF('Data Entry'!C66<>\"\",'Data Entry'!C66,\"\")","v":3},{"$f":"IF('Data Entry'!D66<>\"\",'Data Entry'!D66,\"\")","v":4},{"$f":"IF('Data Entry'!E66<>\"\",'Data Entry'!E66,\"\")","v":3},{"$f":"IF('Data Entry'!F66<>\"\",'Data Entry'!F66,\"\")","v":2},{"$f":"IF('Data Entry'!H66<>\"\",'Data Entry'!H66,\"\")","v":8},{"$f":"IF('Data Entry'!I66<>\"\",'Data Entry'!I66,\"\")","v":41},61,{"$f":"'Data Entry'!$J$103","v":44.551724137931032},null,null,null,null,null,""]
[13,{"$f":"IF('Data Entry'!B67<>0,'Data Entry'!B67,\"\")","v":"Sage, Taber"},{"$f":"IF('Data Entry'!C67<>\"\",'Data Entry'!C67,\"\")","v":3},{"$f":"IF('Data Entry'!D67<>\"\",'Data Entry'!D67,\"\")","v":3},{"$f":"IF('Data Entry'!E67<>\"\",'Data Entry'!E67,\"\")","v":5},{"$f":"IF('Data Entry'!F67<>\"\",'Data Entry'!F67,\"\")","v":3},{"$f":"IF('Data Entry'!H67<>\"\",'Data Entry'!H67,\"\")","v":8},{"$f":"IF('Data Entry'!I67<>\"\",'Data Entry'!I67,\"\")","v":39},61,{"$f":"'Data Entry'!$J$103","v":44.551724137931032},null,null,null,null,null,""]
[14,{"$f":"IF('Data Entry'!B68<>0,'Data Entry'!B68,\"\")","v":"Sarbock, Melanie"},{"$f":"IF('Data Entry'!C68<>\"\",'Data Entry'!C68,\"\")","v":4},{"$f":"IF('Data Entry'!D68<>\"\",'Data Entry'!D68,\"\")","v":4},{"$f":"IF('Data Entry'!E68<>\"\",'Data Entry'!E68,\"\")","v":3},{"$f":"IF('Data Entry'!F68<>\"\",'Data Entry'!F68,\"\")","v":3},{"$f":"IF('Data Entry'!H68<>\"\",'Data Entry'!H68,\"\")","v":6},{"$f":"IF('Data Entry'!I68<>\"\",'Data Entry'!I68,\"\")","v":31},51,{"$f":"'Data Entry'!$J$103","v":44.551724137931032},null,null,null,null,null,""]
[15,{"$f":"IF('Data Entry'!B69<>0,'Data Entry'!B69,\"\")","v":"Senkiw, John"},{"$f":"IF('Data Entry'!C69<>\"\",'Data Entry'!C69,\"\")","v":5},{"$f":"IF('Data Entry'!D69<>\"\",'Data Entry'!D69,\"\")","v":3},{"$f":"IF('Data Entry'!E69<>\"\",'Data Entry'!E69,\"\")","v":3},{"$f":"IF('Data Entry'!F69<>\"\",'Data Entry'!F69,\"\")","v":2},{"$f":"IF('Data Entry'!H69<>\"\",'Data Entry'!H69,\"\")","v":4},{"$f":"IF('Data Entry'!I69<>\"\",'Data Entry'!I69,\"\")","v":37},54,{"$f":"'Data Entry'!$J$103","v":44.551724137931032},null,null,null,null,null,""]
[16,{"$f":"IF('Data Entry'!B70<>0,'Data Entry'!B70,\"\")","v":"Tellery, Simon"},{"$f":"IF('Data Entry'!C70<>\"\",'Data Entry'!C70,\"\")","v":4},{"$f":"IF('Data Entry'!D70<>\"\",'Data Entry'!D70,\"\")","v":2},{"$f":"IF('Data Entry'!E70<>\"\",'Data Entry'!E70,\"\")","v":4},{"$f":"IF('Data Entry'!F70<>\"\",'Data Entry'!F70,\"\")","v":2},{"$f":"IF('Data Entry'!H70<>\"\",'Data Entry'!H70,\"\")","v":3},{"$f":"IF('Data Entry'!I70<>\"\",'Data Entry'!I70,\"\")","v":34},49,{"$f":"'Data Entry'!$J$103","v":44.551724137931032},null,null,null,null,null,""]
[17,{"$f":"IF('Data Entry'!B71<>0,'Data Entry'!B71,\"\")","v":"Ustabar, Vallery"},{"$f":"IF('Data Entry'!C71<>\"\",'Data Entry'!C71,\"\")","v":3},{"$f":"IF('Data Entry'!D71<>\"\",'Data Entry'!D71,\"\")","v":3},{"$f":"IF('Data Entry'!E71<>\"\",'Data Entry'!E71,\"\")","v":3},{"$f":"IF('Data Entry'!F71<>\"\",'Data Entry'!F71,\"\")","v":2},{"$f":"IF('Data Entry'!H71<>\"\",'Data Entry'!H71,\"\")","v":6},{"$f":"IF('Data Entry'!I71<>\"\",'Data Entry'!I71,\"\")","v":25},42,{"$f":"'Data Entry'!$J$103","v":44.551724137931032},null,null,null,null,null,{"$f":"21-COUNTBLANK(P3:P23)","v":1}]
[18,{"$f":"IF('Data Entry'!B72<>0,'Data Entry'!B72,\"\")","v":"Zark, Timmy"},{"$f":"IF('Data Entry'!C72<>\"\",'Data Entry'!C72,\"\")","v":3},{"$f":"IF('Data Entry'!D72<>\"\",'Data Entry'!D72,\"\")","v":2},{"$f":"IF('Data Entry'!E72<>\"\",'Data Entry'!E72,\"\")","v":2},{"$f":"IF('Data Entry'!F72<>\"\",'Data Entry'!F72,\"\")","v":1},{"$f":"IF('Data Entry'!H72<>\"\",'Data Entry'!H72,\"\")","v":4},{"$f":"IF('Data Entry'!I72<>\"\",'Data Entry'!I72,\"\")","v":22},34,{"$f":"'Data Entry'!$J$103","v":44.551724137931032}]
[19,null,null,null,null,null,null,null,"",{"$f":"'Data Entry'!$J$103","v":44.551724137931032}]
[20,null,null,null,null,null,null,null,"",{"$f":"'Data Entry'!$J$103","v":44.551724137931032}]
[21,null,null,null,null,null,null,null,"",{"$f":"'Data Entry'!$J$103","v":44.551724137931032}]
[null,null,null,null,null,null,null,null,{"$f":"'Data Entry'!$J$103","v":44.551724137931032}]
[null,"No. of Highlighted cells ",{"$f":"COUNTIF(C8:C28,\"<\"&C7)","v":2},{"$f":"COUNTIF(D8:D28,\"<\"&D7)","v":1},0,0,2,1,1]
[null,null,null,null,null,null,null,null,{"$f":"'Data Entry'!$J$103","v":44.551724137931032}]
[null,"% of Ss with Sig. Weaknesses ",{"$f":"C30/14*100","v":14.285714285714285},{"$f":"D30/14*100","v":7.1428571428571423},0,0,{"$f":"G30/14*100","v":14.285714285714285},{"$f":"H30/14*100","v":7.1428571428571423},{"$f":"I30/14*100","v":7.1428571428571423}]
[]
[null,"% Degree of Mastery for all Ss ",{"$f":"100-C32","v":85.714285714285722},{"$f":"100-D32","v":92.857142857142861},100,100,"N/A",{"$f":"100-H32","v":92.857142857142861},{"$f":"100-I32","v":92.857142857142861}]
[null,null,null,null,null,null,null,null,null,{"$f":"'Data Entry'!$J$103","v":44.551724137931032}]
[null,null,null,null,null,null,null,null,null,{"$f":"'Data Entry'!$J$103","v":44.551724137931032}]
[null,null,null,null,null,null,null,null,null,{"$f":"'Data Entry'!$J$103","v":44.551724137931032}]

{"sheet":"Class 5","index":7,"n_rows":37,"n_cols":16,"rows_kept":37,"cut":false,"hidden":false,"merged":[[2,0,6,0],[2,2,3,2],[2,3,3,3],[2,4,3,4],[2,5,3,5],[2,6,3,6],[2,7,3,7],[2,8,3,8],[0,2,0,5],[1,2,1,5]]}
[null,"Teacher: ","Helen Anderson"]
[null,"Grade: ","K5V",null,null,null,null,null,null,null,null,null,null,null,null,"At-Risk Students"]
["#",null,"Blending Syllables","Segmenting to Syllables","Blending Phonemes","Segmenting to Phonemes","Phonological Memory","Letter Naming Fluency","Grand  Total",null,null,null,null,null,null,{"$f":"IF(I8<$I$7,B8,\"\")","v":""}]
[null,null,null,null,null,null,null,null,null,null,null,null,null,null,null,"Brow, Lenny"]
[null,null,{"$f":"'Data Entry'!$C$103","v":3.7011494252873565},{"$f":"'Data Entry'!$D$103","v":2.5402298850574714},{"$f":"'Data Entry'!E103","v":2.735632183908046},{"$f":"'Data Entry'!F103","v":1.9195402298850575},{"$f":"'Data Entry'!H103","v":5.5862068965517242},{"$f":"'Data Entry'!$I$103","v":28.068965517241381},{"$f":"'Data Entry'!J103","v":44.551724137931032},"Means",null,null,null,null,null,""]
[null,"Student",{"$f":"'Data Entry'!$C$104","v":1.0242971785427288},{"$f":"'Data Entry'!$D$104","v":0.99772529310018343},{"$f":"'Data Entry'!E104","v":1.2432119888356568},{"$f":"'Data Entry'!F104","v":0.93034615719093861},{"$f":"'Data Entry'!H104","v":1.9442923273958796},{"$f":"'Data Entry'!$I$104","v":11.760985071312451},{"$f":"'Data Entry'!J104","v":15.14331429783504},"Std. Devs.",null,null,null,null,null,"Dedrington, Nick"]
[null,"Names",{"$f":"C5-C6","v":2.6768522467446276},{"$f":"D5-D6","v":1.542504591957288},{"$f":"E5-E6","v":1.4924201950723892},0.98919407269411885,3.6419145691558445,16.30798044592893,{"$f":"I5-(I6)","v":29.408409840095992},"Cut-off Scores",null,null,null,null,null,""]
[1,{"$f":"IF('Data Entry'!B73<>0,'Data Entry'!B73,\"\")","v":"Belburg, Elise"},{"$f":"IF('Data Entry'!C73<>\"\",'Data Entry'!C73,\"\")","v":5},{"$f":"IF('Data Entry'!D73<>\"\",'Data Entry'!D73,\"\")","v":2},{"$f":"IF('Data Entry'!E73<>\"\",'Data Entry'!E73,\"\")","v":4},{"$f":"IF('Data Entry'!F73<>\"\",'Data Entry'!F73,\"\")","v":2},{"$f":"IF('Data Entry'!H73<>\"\",'Data Entry'!H73,\"\")","v":4},{"$f":"IF('Data Entry'!I73<>\"\",'Data Entry'!I73,\"\")","v":18},{"$f":"IF(SUM(C8:H8)<>0,SUM(C8:H8),\"\")","v":35},{"$f":"'Data Entry'!$J$103","v":44.551724137931032},null,null,null,null,null,""]
[2,{"$f":"IF('Data Entry'!B74<>0,'Data Entry'!B74,\"\")","v":"Brow, Lenny"},{"$f":"IF('Data Entry'!C74<>\"\",'Data Entry'!C74,\"\")","v":2},{"$f":"IF('Data Entry'!D74<>\"\",'Data Entry'!D74,\"\")","v":1},{"$f":"IF('Data Entry'!E74<>\"\",'Data Entry'!E74,\"\")","v":2},{"$f":"IF('Data Entry'!F74<>\"\",'Data Entry'!F74,\"\")","v":1},{"$f":"IF('Data Entry'!H74<>\"\",'Data Entry'!H74,\"\")","v":1},{"$f":"IF('Data Entry'!I74<>\"\",'Data Entry'!I74,\"\")","v":8},{"$f":"IF(SUM(C9:H9)<>0,SUM(C9:H9),\"\")","v":15},{"$f":"'Data Entry'!$J$103","v":44.551724137931032},null,null,null,null,null,"Pattern, Viyan"]
[3,{"$f":"IF('Data Entry'!B75<>0,'Data Entry'!B75,\"\")","v":"Cramer, Sophie"},{"$f":"IF('Data Entry'!C75<>\"\",'Data Entry'!C75,\"\")","v":4},{"$f":"IF('Data Entry'!D75<>\"\",'Data Entry'!D75,\"\")","v":3},{"$f":"IF('Data Entry'!E75<>\"\",'Data Entry'!E75,\"\")","v":4},{"$f":"IF('Data Entry'!F75<>\"\",'Data Entry'!F75,\"\")","v":3},{"$f":"IF('Data Entry'!H75<>\"\",'Data Entry'!H75,\"\")","v":8},{"$f":"IF('Data Entry'!I75<>\"\",'Data Entry'!I75,\"\")","v":36},{"$f":"IF(SUM(C10:H10)<>0,SUM(C10:H10),\"\")","v":58},{"$f":"'Data Entry'!$J$103","v":44.551724137931032},null,null,null,null,null,"Pries, Nolan"]
[4,{"$f":"IF('Data Entry'!B76<>0,'Data Entry'!B76,\"\")","v":"Dedrington, Nick"},{"$f":"IF('Data Entry'!C76<>\"\",'Data Entry'!C76,\"\")","v":5},{"$f":"IF('Data Entry'!D76<>\"\",'Data Entry'!D76,\"\")","v":2},{"$f":"IF('Data Entry'!E76<>\"\",'Data Entry'!E76,\"\")","v":2},{"$f":"IF('Data Entry'!F76<>\"\",'Data Entry'!F76,\"\")","v":1},{"$f":"IF('Data Entry'!H76<>\"\",'Data Entry'!H76,\"\")","v":3},{"$f":"IF('Data Entry'!I76<>\"\",'Data Entry'!I76,\"\")","v":15},28,{"$f":"'Data Entry'!$J$103","v":44.551724137931032},null,null,null,null,null,""]
[5,{"$f":"IF('Data Entry'!B77<>0,'Data Entry'!B77,\"\")","v":"Enns, Benjamin"},{"$f":"IF('Data Entry'!C77<>\"\",'Data Entry'!C77,\"\")","v":5},{"$f":"IF('Data Entry'!D77<>\"\",'Data Entry'!D77,\"\")","v":2},{"$f":"IF('Data Entry'!E77<>\"\",'Data Entry'!E77,\"\")","v":1},{"$f":"IF('Data Entry'!F77<>\"\",'Data Entry'!F77,\"\")","v":1},{"$f":"IF('Data Entry'!H77<>\"\",'Data Entry'!H77,\"\")","v":3},{"$f":"IF('Data Entry'!I77<>\"\",'Data Entry'!I77,\"\")","v":20},32,{"$f":"'Data Entry'!$J$103","v":44.551724137931032},null,null,null,null,null,""]
[6,{"$f":"IF('Data Entry'!B78<>0,'Data Entry'!B78,\"\")","v":"Passenger, Phoebe"},{"$f":"IF('Data Entry'!C78<>\"\",'Data Entry'!C78,\"\")","v":4},{"$f":"IF('Data Entry'!D78<>\"\",'Data Entry'!D78,\"\")","v":2},{"$f":"IF('Data Entry'!E78<>\"\",'Data Entry'!E78,\"\")","v":2},{"$f":"IF('Data Entry'!F78<>\"\",'Data Entry'!F78,\"\")","v":2},{"$f":"IF('Data Entry'!H78<>\"\",'Data Entry'!H78,\"\")","v":5},{"$f":"IF('Data Entry'!I78<>\"\",'Data Entry'!I78,\"\")","v":42},57,{"$f":"'Data Entry'!$J$103","v":44.551724137931032},null,null,null,null,null,""]
[7,{"$f":"IF('Data Entry'!B79<>0,'Data Entry'!B79,\"\")","v":"Pattern, Viyan"},{"$f":"IF('Data Entry'!C79<>\"\",'Data Entry'!C79,\"\")","v":3},{"$f":"IF('Data Entry'!D79<>\"\",'Data Entry'!D79,\"\")","v":1},{"$f":"IF('Data Entry'!E79<>\"\",'Data Entry'!E79,\"\")","v":1},{"$f":"IF('Data Entry'!F79<>\"\",'Data Entry'!F79,\"\")","v":1},{"$f":"IF('Data Entry'!H79<>\"\",'Data Entry'!H79,\"\")","v":2},{"$f":"IF('Data Entry'!I79<>\"\",'Data Entry'!I79,\"\")","v":14},22,{"$f":"'Data Entry'!$J$103","v":44.551724137931032},null,null,null,null,null,""]
[8,{"$f":"IF('Data Entry'!B80<>0,'Data Entry'!B80,\"\")","v":"Pries, Nolan"},{"$f":"IF('Data Entry'!C80<>\"\",'Data Entry'!C80,\"\")","v":3},{"$f":"IF('Data Entry'!D80<>\"\",'Data Entry'!D80,\"\")","v":1},{"$f":"IF('Data Entry'!E80<>\"\",'Data Entry'!E80,\"\")","v":1},{"$f":"IF('Data Entry'!F80<>\"\",'Data Entry'!F80,\"\")","v":1},{"$f":"IF('Data Entry'!H80<>\"\",'Data Entry'!H80,\"\")","v":3},{"$f":"IF('Data Entry'!I80<>\"\",'Data Entry'!I80,\"\")","v":19},28,{"$f":"'Data Entry'!$J$103","v":44.551724137931032},null,null,null,null,null,""]
[9,{"$f":"IF('Data Entry'!B81<>0,'Data Entry'!B81,\"\")","v":"Prodical, Sophie"},{"$f":"IF('Data Entry'!C81<>\"\",'Data Entry'!C81,\"\")","v":2},{"$f":"IF('Data Entry'!D81<>\"\",'Data Entry'!D81,\"\")","v":4},{"$f":"IF('Data Entry'!E81<>\"\",'Data Entry'!E81,\"\")","v":3},{"$f":"IF('Data Entry'!F81<>\"\",'Data Entry'!F81,\"\")","v":2},{"$f":"IF('Data Entry'!H81<>\"\",'Data Entry'!H81,\"\")","v":8},{"$f":"IF('Data Entry'!I81<>\"\",'Data Entry'!I81,\"\")","v":24},43,{"$f":"'Data Entry'!$J$103","v":44.551724137931032},null,null,null,null,null,""]
[10,{"$f":"IF('Data Entry'!B82<>0,'Data Entry'!B82,\"\")","v":"Rockport, Sandra"},{"$f":"IF('Data Entry'!C82<>\"\",'Data Entry'!C82,\"\")","v":3},{"$f":"IF('Data Entry'!D82<>\"\",'Data Entry'!D82,\"\")","v":3},{"$f":"IF('Data Entry'!E82<>\"\",'Data Entry'!E82,\"\")","v":2},{"$f":"IF('Data Entry'!F82<>\"\",'Data Entry'!F82,\"\")","v":2},{"$f":"IF('Data Entry'!H82<>\"\",'Data Entry'!H82,\"\")","v":5},{"$f":"IF('Data Entry'!I82<>\"\",'Data Entry'!I82,\"\")","v":28},43,{"$f":"'Data Entry'!$J$103","v":44.551724137931032},null,null,null,null,null,"Wollmann, Jayson"]
[11,{"$f":"IF('Data Entry'!B83<>0,'Data Entry'!B83,\"\")","v":"Sarkuchi, Danny"},{"$f":"IF('Data Entry'!C83<>\"\",'Data Entry'!C83,\"\")","v":3},{"$f":"IF('Data Entry'!D83<>\"\",'Data Entry'!D83,\"\")","v":2},{"$f":"IF('Data Entry'!E83<>\"\",'Data Entry'!E83,\"\")","v":1},{"$f":"IF('Data Entry'!F83<>\"\",'Data Entry'!F83,\"\")","v":1},{"$f":"IF('Data Entry'!H83<>\"\",'Data Entry'!H83,\"\")","v":4},{"$f":"IF('Data Entry'!I83<>\"\",'Data Entry'!I83,\"\")","v":22},33,{"$f":"'Data Entry'!$J$103","v":44.551724137931032},null,null,null,null,null,""]
[12,{"$f":"IF('Data Entry'!B84<>0,'Data Entry'!B84,\"\")","v":"Schneider, Lucas"},{"$f":"IF('Data Entry'!C84<>\"\",'Data Entry'!C84,\"\")","v":4},{"$f":"IF('Data Entry'!D84<>\"\",'Data Entry'!D84,\"\")","v":2},{"$f":"IF('Data Entry'!E84<>\"\",'Data Entry'!E84,\"\")","v":2},{"$f":"IF('Data Entry'!F84<>\"\",'Data Entry'!F84,\"\")","v":1},{"$f":"IF('Data Entry'!H84<>\"\",'Data Entry'!H84,\"\")","v":4},{"$f":"IF('Data Entry'!I84<>\"\",'Data Entry'!I84,\"\")","v":19},32,{"$f":"'Data Entry'!$J$103","v":44.551724137931032},null,null,null,null,null,""]
[13,{"$f":"IF('Data Entry'!B85<>0,'Data Entry'!B85,\"\")","v":"Sellandro, Dennis"},{"$f":"IF('Data Entry'!C85<>\"\",'Data Entry'!C85,\"\")","v":5},{"$f":"IF('Data Entry'!D85<>\"\",'Data Entry'!D85,\"\")","v":3},{"$f":"IF('Data Entry'!E85<>\"\",'Data Entry'!E85,\"\")","v":3},{"$f":"IF('Data Entry'!F85<>\"\",'Data Entry'!F85,\"\")","v":2},{"$f":"IF('Data Entry'!H85<>\"\",'Data Entry'!H85,\"\")","v":6},{"$f":"IF('Data Entry'!I85<>\"\",'Data Entry'!I85,\"\")","v":34},53,{"$f":"'Data Entry'!$J$103","v":44.551724137931032},null,null,null,null,null,""]
[14,{"$f":"IF('Data Entry'!B86<>0,'Data Entry'!B86,\"\")","v":"Wallburg, Rose"},{"$f":"IF('Data Entry'!C86<>\"\",'Data Entry'!C86,\"\")","v":4},{"$f":"IF('Data Entry'!D86<>\"\",'Data Entry'!D86,\"\")","v":2},{"$f":"IF('Data Entry'!E86<>\"\",'Data Entry'!E86,\"\")","v":2},{"$f":"IF('Data Entry'!F86<>\"\",'Data Entry'!F86,\"\")","v":1},{"$f":"IF('Data Entry'!H86<>\"\",'Data Entry'!H86,\"\")","v":7},{"$f":"IF('Data Entry'!I86<>\"\",'Data Entry'!I86,\"\")","v":26},42,{"$f":"'Data Entry'!$J$103","v":44.551724137931032},null,null,null,null,null,""]
[15,{"$f":"IF('Data Entry'!B87<>0,'Data Entry'!B87,\"\")","v":"Wollmann, Jayson"},{"$f":"IF('Data Entry'!C87<>\"\",'Data Entry'!C87,\"\")","v":3},{"$f":"IF('Data Entry'!D87<>\"\",'Data Entry'!D87,\"\")","v":2},{"$f":"IF('Data Entry'!E87<>\"\",'Data Entry'!E87,\"\")","v":1},{"$f":"IF('Data Entry'!F87<>\"\",'Data Entry'!F87,\"\")","v":1},{"$f":"IF('Data Entry'!H87<>\"\",'Data Entry'!H87,\"\")","v":3},{"$f":"IF('Data Entry'!I87<>\"\",'Data Entry'!I87,\"\")","v":19},29,{"$f":"'Data Entry'!$J$103","v":44.551724137931032},null,null,null,null,null,""]
[16,{"$f":"IF('Data Entry'!B88<>0,'Data Entry'!B88,\"\")","v":"Wood, Anna"},{"$f":"IF('Data Entry'!C88<>\"\",'Data Entry'!C88,\"\")","v":4},{"$f":"IF('Data Entry'!D88<>\"\",'Data Entry'!D88,\"\")","v":3},{"$f":"IF('Data Entry'!E88<>\"\",'Data Entry'!E88,\"\")","v":3},{"$f":"IF('Data Entry'!F88<>\"\",'Data Entry'!F88,\"\")","v":2},{"$f":"IF('Data Entry'!H88<>\"\",'Data Entry'!H88,\"\")","v":9},{"$f":"IF('Data Entry'!I88<>\"\",'Data Entry'!I88,\"\")","v":29},50,{"$f":"'Data Entry'!$J$103","v":44.551724137931032},null,null,null,null,null,""]
[17,{"$f":"IF('Data Entry'!B89<>0,'Data Entry'!B89,\"\")","v":"Yong, Liam"},{"$f":"IF('Data Entry'!C89<>\"\",'Data Entry'!C89,\"\")","v":5},{"$f":"IF('Data Entry'!D89<>\"\",'Data Entry'!D89,\"\")","v":5},{"$f":"IF('Data Entry'!E89<>\"\",'Data Entry'!E89,\"\")","v":3},{"$f":"IF('Data Entry'!F89<>\"\",'Data Entry'!F89,\"\")","v":3},{"$f":"IF('Data Entry'!H89<>\"\",'Data Entry'!H89,\"\")","v":9},{"$f":"IF('Data Entry'!I89<>\"\",'Data Entry'!I89,\"\")","v":42},67,{"$f":"'Data Entry'!$J$103","v":44.551724137931032},null,null,null,null,null,{"$f":"21-COUNTBLANK(P3:P23)","v":5}]
[18,null,null,null,null,null,null,null,"",{"$f":"'Data Entry'!$J$103","v":44.551724137931032}]
[19,null,null,null,null,null,null,null,"",{"$f":"'Data Entry'!$J$103","v":44.551724137931032}]
[20,null,null,null,null,null,null,null,"",{"$f":"'Data Entry'!$J$103","v":44.551724137931032}]
[21,null,null,null,null,null,null,null,"",{"$f":"'Data Entry'!$J$103","v":44.551724137931032}]
[null,null,null,null,null,null,null,null,{"$f":"'Data Entry'!$J$103","v":44.551724137931032}]
[null,"No. of Highlighted cells ",{"$f":"COUNTIF(C8:C28,\"<\"&C7)","v":2},{"$f":"COUNTIF(D8:D28,\"<\"&D7)","v":3},5,0,6,3,5]
[null,null,null,null,null,null,null,null,{"$f":"'Data Entry'!$J$103","v":44.551724137931032}]
[null,"% of Ss with Sig. Weaknesses ",{"$f":"C30/14*100","v":14.285714285714285},{"$f":"D30/14*100","v":21.428571428571427},35.714285714285715,0,{"$f":"G30/14*100","v":42.857142857142854},{"$f":"H30/14*100","v":21.428571428571427},{"$f":"I30/14*100","v":35.714285714285715}]
[]
[null,"% Degree of Mastery for all Ss ",{"$f":"100-C32","v":85.714285714285722},{"$f":"100-D32","v":78.571428571428569},64.285714285714278,100,"N/A",{"$f":"100-H32","v":78.571428571428569},{"$f":"100-I32","v":64.285714285714278}]
[null,null,null,null,null,null,null,null,null,{"$f":"'Data Entry'!$J$103","v":44.551724137931032}]
[null,null,null,null,null,null,null,null,null,{"$f":"'Data Entry'!$J$103","v":44.551724137931032}]
[null,null,null,null,null,null,null,null,null,{"$f":"'Data Entry'!$J$103","v":44.551724137931032}]

{"sheet":" Std Sc. Graph 1","index":8,"n_rows":25,"n_cols":8,"rows_kept":25,"cut":false,"hidden":false,"merged":[[2,1,3,1],[0,2,1,2],[2,4,3,4]]}
[null,null,"Grand  Total"]
[]
[null,"Student Names",{"$f":"'Class 1'!$I$5","v":44.551724137931032},null,"Standard Scores"]
[null,null,{"$f":"'Class 1'!$I$6","v":15.14331429783504}]
[null,{"$f":"'Class 1'!B8","v":"Akinomesk, Joshua"},{"$f":"'Class 1'!I8","v":71},{"$f":"IF(C5=0,\"\",(C5-$C$3)/$C$4)","v":1.7465315281642235},{"$f":"100+D5*(15)","v":126.19797292246335},{"$f":"E5","v":126.19797292246335},{"$f":"IF(F5>=85,F5,\"\")","v":126.19797292246335},{"$f":"IF(F5<85,F5,\"\")","v":""}]
[null,{"$f":"'Class 1'!B9","v":"Anderski, Violet"},{"$f":"'Class 1'!I9","v":53},{"$f":"IF(C6=0,\"\",(C6-$C$3)/$C$4)","v":0.55788816740578206},{"$f":"100+D6*(15)","v":108.36832251108673},108.36832251108673,{"$f":"IF(F6>=85,F6,\"\")","v":108.36832251108673},{"$f":"IF(F6<85,F6,\"\")","v":""}]
[null,{"$f":"'Class 1'!B10","v":"Actara, Belle"},{"$f":"'Class 1'!I10","v":10},-2.2816487499616058,65.775268750575918,65.775268750575918,{"$f":"IF(F7>=85,F7,\"\")","v":""},65.775268750575918]
[null,{"$f":"'Class 1'!B11","v":"Bandito, Nicole"},{"$f":"'Class 1'!I11","v":25},-1.2911126159962378,80.633310760056432,80.633310760056432,"",80.633310760056432]
[null,{"$f":"'Class 1'!B12","v":"Capriano, Geno"},{"$f":"'Class 1'!I12","v":67},1.482388559106792,122.23582838660188,122.23582838660188,122.23582838660188,""]
[null,{"$f":"'Class 1'!B13","v":"Dweck, Kaori"},{"$f":"'Class 1'!I13","v":56},0.75599539419885564,111.33993091298284,111.33993091298284,111.33993091298284,""]
[null,{"$f":"'Class 1'!B14","v":"Essman, Cal"},{"$f":"'Class 1'!I14","v":46},9.5637971555277063E-2,101.43456957332916,101.43456957332916,101.43456957332916,""]
[null,{"$f":"'Class 1'!B15","v":"Fast, Autumn"},{"$f":"'Class 1'!I15","v":61},1.0861741055206449,116.29261158280967,116.29261158280967,116.29261158280967,""]
[null,{"$f":"'Class 1'!B16","v":"Greenwall, Brayden"},{"$f":"'Class 1'!I16","v":66},1.4163528168424342,121.24529225263652,121.24529225263652,121.24529225263652,""]
[null,{"$f":"'Class 1'!B17","v":"Hallenko, Pierce"},{"$f":"'Class 1'!I17","v":19},-1.687327069582385,74.690093956264221,74.690093956264221,"",74.690093956264221]
[null,{"$f":"'Class 1'!B18","v":"Lowen, Hunter"},{"$f":"'Class 1'!I18","v":52},0.49185242514142419,107.37778637712137,107.37778637712137,107.37778637712137,""]
[null,{"$f":"'Class 1'!B19","v":"Marbel, Melody"},{"$f":"'Class 1'!I19","v":42},-0.16850499750215436,97.472425037467687,97.472425037467687,97.472425037467687,""]
[null,{"$f":"'Class 1'!B20","v":"Peterson, Carmen"},{"$f":"'Class 1'!I20","v":17},-1.8193985541111009,72.709021688333479,72.709021688333479,"",72.709021688333479]
[null,{"$f":"'Class 1'!B21","v":"Rice, Bruce"},{"$f":"'Class 1'!I21","v":44},-3.6433512973438657E-2,99.453497305398415,99.453497305398415,99.453497305398415,""]
[null,{"$f":"'Class 1'!B22","v":0},{"$f":"'Class 1'!I22","v":""},{"$error":"#VALUE!"},null,0,"",0]
[null,{"$f":"'Class 1'!B23","v":0},{"$f":"'Class 1'!I23","v":""},{"$error":"#VALUE!"},null,0,"",0]
[null,{"$f":"'Class 1'!B24","v":0},{"$f":"'Class 1'!I24","v":""},{"$error":"#VALUE!"},null,0,"",0]
[null,{"$f":"'Class 1'!B25","v":0},{"$f":"'Class 1'!I25","v":""},{"$error":"#VALUE!"},null,0,"",0]
[null,{"$f":"'Class 1'!B26","v":0},{"$f":"'Class 1'!I26","v":""},{"$error":"#VALUE!"},null,0,"",0]
[null,{"$f":"'Class 1'!B27","v":0},{"$f":"'Class 1'!I27","v":""},{"$error":"#VALUE!"},null,0,"",0]
[null,{"$f":"'Class 1'!B28","v":0},{"$f":"'Class 1'!I28","v":""},{"$error":"#VALUE!"},null,0,"",0]

{"sheet":" Std Sc. Graph 2","index":9,"n_rows":32,"n_cols":8,"rows_kept":32,"cut":false,"hidden":false,"merged":[[0,2,1,2],[2,1,3,1],[2,4,3,4]]}
[null,null,"Grand  Total"]
[]
[null,"Student Names",{"$f":"'Class 1'!$I$5","v":44.551724137931032},null,"Standard Scores"]
[null,null,{"$f":"'Class 1'!$I$6","v":15.14331429783504}]
[null,{"$f":"'Data Entry'!B17","v":"Broman, Clara"},{"$f":"'Class 2'!I8","v":39},{"$f":"IF(C5=0,\"\",(C5-$C$3)/$C$4)","v":-0.36661222429522794},{"$f":"100+D5*(15)","v":94.500816635571582},{"$f":"E5","v":94.500816635571582},{"$f":"IF(F5>=85,F5,\"\")","v":94.500816635571582},{"$f":"IF(F5<85,F5,\"\")","v":""}]
[null,{"$f":"'Data Entry'!B18","v":"Catchy, Danny"},{"$f":"'Class 2'!I9","v":52},{"$f":"IF(C6=0,\"\",(C6-$C$3)/$C$4)","v":0.49185242514142419},{"$f":"100+D6*(15)","v":107.37778637712137},107.37778637712137,{"$f":"IF(F6>=85,F6,\"\")","v":107.37778637712137},{"$f":"IF(F6<85,F6,\"\")","v":""}]
[null,{"$f":"'Data Entry'!B19","v":"Cayburn, Karl"},{"$f":"'Class 2'!I10","v":57},0.82203113646321346,112.3304670469482,112.3304670469482,112.3304670469482,""]
[null,{"$f":"'Data Entry'!B20","v":"Demonslayer, Darryl"},{"$f":"'Class 2'!I11","v":22},-1.4892198427893115,77.661702358160326,77.661702358160326,"",77.661702358160326]
[null,{"$f":"'Data Entry'!B21","v":"Hanson, Sawyer"},{"$f":"'Class 2'!I12","v":20},-1.6212913273180272,75.680630090229585,75.680630090229585,"",75.680630090229585]
[null,{"$f":"'Data Entry'!B22","v":"Hiebert, Bruce"},{"$f":"'Class 2'!I13","v":69},1.6144600436355079,124.21690065453262,124.21690065453262,124.21690065453262,""]
[null,{"$f":"'Data Entry'!B23","v":"Heidelburg, Corby"},{"$f":"'Class 2'!I14","v":55},0.68995965193449782,110.34939477901747,110.34939477901747,110.34939477901747,""]
[null,{"$f":"'Data Entry'!B24","v":"Krinkle, Luke"},{"$f":"'Class 2'!I15","v":34},-0.69679093561701722,89.548135965744734,89.548135965744734,89.548135965744734,""]
[null,{"$f":"'Data Entry'!B25","v":"Lagensky, Patty"},{"$f":"'Class 2'!I16","v":20},-1.6212913273180272,75.680630090229585,75.680630090229585,"",75.680630090229585]
[null,{"$f":"'Data Entry'!B26","v":"Lorrey, Fred"},{"$f":"'Class 2'!I17","v":27},-1.1590411314675222,82.614383027987174,82.614383027987174,"",82.614383027987174]
[null,{"$f":"'Data Entry'!B27","v":"Marvel, Captain"},{"$f":"'Class 2'!I18","v":37},-0.49868370882394364,92.51974436764084,92.51974436764084,92.51974436764084,""]
[null,{"$f":"'Data Entry'!B28","v":"Manswella, Rico"},{"$f":"'Class 2'!I19","v":50},0.35978094061270849,105.39671410919063,105.39671410919063,105.39671410919063,""]
[null,{"$f":"'Data Entry'!B29","v":"Ohera, Marian"},{"$f":"'Class 2'!I20","v":27},-1.1590411314675222,82.614383027987174,82.614383027987174,"",82.614383027987174]
[null,{"$f":"'Data Entry'!B30","v":"Penner, Annie"},{"$f":"'Class 2'!I21","v":40},-0.30057648203087006,95.491352769536945,95.491352769536945,95.491352769536945,""]
[null,{"$f":"'Data Entry'!B31","v":"Sarbucker, Cassedy"},{"$f":"'Class 2'!I22","v":26},-1.22507687373188,81.623846894021796,81.623846894021796,"",81.623846894021796]
[null,{"$f":"'Data Entry'!B32","v":"Schell, John"},{"$f":"'Class 2'!I23","v":39},-0.36661222429522794,94.500816635571582,94.500816635571582,94.500816635571582,""]
[null,{"$f":"'Data Entry'!B33","v":"Skaper, Leah"},{"$f":"'Class 2'!I24","v":24},-1.3571483582605959,79.642774626091068,79.642774626091068,"",79.642774626091068]
[null,{"$f":"'Data Entry'!B34","v":"Shneider, Ingrid"},{"$f":"'Class 2'!I25","v":27},-1.1590411314675222,82.614383027987174,82.614383027987174,"",82.614383027987174]
[null,{"$f":"'Data Entry'!B35","v":"klywalker, Eric"},{"$f":"'Class 2'!I26","v":43},-0.10246925523779651,98.462961171433051,98.462961171433051,98.462961171433051,""]
[null,{"$f":"'Data Entry'!B36","v":"Voit, John"},{"$f":"'Class 2'!I27","v":47},0.16167371381963491,102.42510570729452,102.42510570729452,102.42510570729452,""]
[]
[]
[]
[]
[]
[]
[]
[null,null,"psych"]

{"sheet":" Std Sc. Graph 3","index":10,"n_rows":22,"n_cols":8,"rows_kept":22,"cut":false,"hidden":false,"merged":[[0,2,1,2],[2,1,3,1],[2,4,3,4]]}
[null,null,"Grand  Total"]
[]
[null,"Student Names",{"$f":"'Class 1'!$I$5","v":44.551724137931032},null,"Standard Scores"]
[null,null,{"$f":"'Class 1'!$I$6","v":15.14331429783504}]
[null,{"$f":"'Data Entry'!B37","v":"Benito, Ester"},{"$f":"'Class 3'!I8","v":37},{"$f":"IF(C5=0,\"\",(C5-$C$3)/$C$4)","v":-0.49868370882394364},{"$f":"100+D5*(15)","v":92.51974436764084},{"$f":"E5","v":92.51974436764084},{"$f":"IF(F5>=85,F5,\"\")","v":92.51974436764084},{"$f":"IF(F5<85,F5,\"\")","v":""}]
[null,{"$f":"'Data Entry'!B38","v":"Dorito, Danny"},{"$f":"'Class 3'!I9","v":22},{"$f":"IF(C6=0,\"\",(C6-$C$3)/$C$4)","v":-1.4892198427893115},{"$f":"100+D6*(15)","v":77.661702358160326},77.661702358160326,{"$f":"IF(F6>=85,F6,\"\")","v":""},{"$f":"IF(F6<85,F6,\"\")","v":77.661702358160326}]
[null,{"$f":"'Data Entry'!B39","v":"Friesen, Elaine"},{"$f":"'Class 3'!I10","v":59},0.95410262099192922,114.31153931487894,114.31153931487894,114.31153931487894,""]
[null,{"$f":"'Data Entry'!B40","v":"Fronk, Clara"},{"$f":"'Class 3'!I11","v":59},0.95410262099192922,114.31153931487894,114.31153931487894,114.31153931487894,""]
[null,{"$f":"'Data Entry'!B41","v":"Gillingham, Teddy"},{"$f":"'Class 3'!I12","v":40},-0.30057648203087006,95.491352769536945,95.491352769536945,95.491352769536945,""]
[null,{"$f":"'Data Entry'!B42","v":"Harder, Hellen"},{"$f":"'Class 3'!I13","v":58},0.8880668787275714,113.32100318091358,113.32100318091358,113.32100318091358,""]
[null,{"$f":"'Data Entry'!B43","v":"Heinrichs, Audrey"},{"$f":"'Class 3'!I14","v":49},0.29374519834835061,104.40617797522526,104.40617797522526,104.40617797522526,""]
[null,{"$f":"'Data Entry'!B44","v":"Hofmann, Joan"},{"$f":"'Class 3'!I15","v":69},1.6144600436355079,124.21690065453262,124.21690065453262,124.21690065453262,""]
[null,{"$f":"'Data Entry'!B45","v":"Klippenstein, Joey"},{"$f":"'Class 3'!I16","v":54},0.62392390967013989,109.35885864505209,109.35885864505209,109.35885864505209,""]
[null,{"$f":"'Data Entry'!B46","v":"Kolair, Henry"},{"$f":"'Class 3'!I17","v":65},1.3503170745780764,120.25475611867114,120.25475611867114,120.25475611867114,""]
[null,{"$f":"'Data Entry'!B47","v":"Marquette, Ryan"},{"$f":"'Class 3'!I18","v":61},1.0861741055206449,116.29261158280967,116.29261158280967,116.29261158280967,""]
[null,{"$f":"'Data Entry'!B48","v":"Martin, Katie"},{"$f":"'Class 3'!I19","v":70},1.6804957858998657,125.20743678849799,125.20743678849799,125.20743678849799,""]
[null,{"$f":"'Data Entry'!B49","v":"Mutch, Jayden"},{"$f":"'Class 3'!I20","v":47},0.16167371381963491,102.42510570729452,102.42510570729452,102.42510570729452,""]
[null,{"$f":"'Data Entry'!B50","v":"Penner, Robert"},{"$f":"'Class 3'!I21","v":58},0.8880668787275714,113.32100318091358,113.32100318091358,113.32100318091358,""]
[null,{"$f":"'Data Entry'!B51","v":"Schultz, Mario"},{"$f":"'Class 3'!I22","v":47},0.16167371381963491,102.42510570729452,102.42510570729452,102.42510570729452,""]
[null,{"$f":"'Data Entry'!B52","v":"Smith, Abby"},{"$f":"'Class 3'!I23","v":55},0.68995965193449782,110.34939477901747,110.34939477901747,110.34939477901747,""]
[null,{"$f":"'Data Entry'!B53","v":"Vogt, Adelle"},{"$f":"'Class 3'!I24","v":62},1.1522098477850027,117.28314771677503,117.28314771677503,117.28314771677503,""]
[null,{"$f":"'Data Entry'!B54","v":"Zilberman, Toni"},{"$f":"'Class 3'!I25","v":42},-0.16850499750215436,97.472425037467687,97.472425037467687,97.472425037467687,""]

{"sheet":" Std Sc. Graph 4","index":11,"n_rows":22,"n_cols":8,"rows_kept":22,"cut":false,"hidden":false,"merged":[[0,2,1,2],[2,1,3,1],[2,4,3,4]]}
[null,null,"Grand  Total"]
[]
[null,"Student Names",{"$f":"'Class 1'!$I$5","v":44.551724137931032},null,"Standard Scores"]
[null,null,{"$f":"'Class 1'!$I$6","v":15.14331429783504}]
[null,{"$f":"'Data Entry'!B55","v":"Ardene, Mary"},{"$f":"'Class 4'!I8","v":53},{"$f":"IF(C5=0,\"\",(C5-$C$3)/$C$4)","v":0.55788816740578206},{"$f":"100+D5*(15)","v":108.36832251108673},{"$f":"E5","v":108.36832251108673},{"$f":"IF(F5>=85,F5,\"\")","v":108.36832251108673},{"$f":"IF(F5<85,F5,\"\")","v":""}]
[null,{"$f":"'Data Entry'!B56","v":"Brother, Peter"},{"$f":"'Class 4'!I9","v":62},{"$f":"IF(C6=0,\"\",(C6-$C$3)/$C$4)","v":1.1522098477850027},{"$f":"100+D6*(15)","v":117.28314771677503},117.28314771677503,{"$f":"IF(F6>=85,F6,\"\")","v":117.28314771677503},{"$f":"IF(F6<85,F6,\"\")","v":""}]
[null,{"$f":"'Data Entry'!B57","v":"Bugeate, Moreen"},{"$f":"'Class 4'!I10","v":20},-1.6212913273180272,75.680630090229585,75.680630090229585,"",75.680630090229585]
[null,{"$f":"'Data Entry'!B58","v":"Candy, William"},{"$f":"'Class 4'!I11","v":49},0.29374519834835061,104.40617797522526,104.40617797522526,104.40617797522526,""]
[null,{"$f":"'Data Entry'!B59","v":"Dyck, Teddy"},{"$f":"'Class 4'!I12","v":38},-0.43264796655958582,93.510280501606218,93.510280501606218,93.510280501606218,""]
[null,{"$f":"'Data Entry'!B60","v":"Hudson, Harriette"},{"$f":"'Class 4'!I13","v":58},0.8880668787275714,113.32100318091358,113.32100318091358,113.32100318091358,""]
[null,{"$f":"'Data Entry'!B61","v":"Messia, Penny"},{"$f":"'Class 4'!I14","v":48},0.22770945608399276,103.4156418412599,103.4156418412599,103.4156418412599,""]
[null,{"$f":"'Data Entry'!B62","v":"Penner, Elaine"},{"$f":"'Class 4'!I15","v":62},1.1522098477850027,117.28314771677503,117.28314771677503,117.28314771677503,""]
[null,{"$f":"'Data Entry'!B63","v":"Rajooley, Anna"},{"$f":"'Class 4'!I16","v":42},-0.16850499750215436,97.472425037467687,97.472425037467687,97.472425037467687,""]
[null,{"$f":"'Data Entry'!B64","v":"Renzulli, Leah"},{"$f":"'Class 4'!I17","v":38},-0.43264796655958582,93.510280501606218,93.510280501606218,93.510280501606218,""]
[null,{"$f":"'Data Entry'!B65","v":"Roxmeyer, Zoey"},{"$f":"'Class 4'!I18","v":49},0.29374519834835061,104.40617797522526,104.40617797522526,104.40617797522526,""]
[null,{"$f":"'Data Entry'!B66","v":"Sailing, Mark"},{"$f":"'Class 4'!I19","v":61},1.0861741055206449,116.29261158280967,116.29261158280967,116.29261158280967,""]
[null,{"$f":"'Data Entry'!B67","v":"Sage, Taber"},{"$f":"'Class 4'!I20","v":61},1.0861741055206449,116.29261158280967,116.29261158280967,116.29261158280967,""]
[null,{"$f":"'Data Entry'!B68","v":"Sarbock, Melanie"},{"$f":"'Class 4'!I21","v":51},0.42581668287706637,106.38725024315599,106.38725024315599,106.38725024315599,""]
[null,{"$f":"'Data Entry'!B69","v":"Senkiw, John"},{"$f":"'Class 4'!I22","v":54},0.62392390967013989,109.35885864505209,109.35885864505209,109.35885864505209,""]
[null,{"$f":"'Data Entry'!B70","v":"Tellery, Simon"},{"$f":"'Class 4'!I23","v":49},0.29374519834835061,104.40617797522526,104.40617797522526,104.40617797522526,""]
[null,{"$f":"'Data Entry'!B71","v":"Ustabar, Vallery"},{"$f":"'Class 4'!I24","v":42},-0.16850499750215436,97.472425037467687,97.472425037467687,97.472425037467687,""]
[null,{"$f":"'Data Entry'!B72","v":"Zark, Timmy"},{"$f":"'Class 4'!I25","v":34},-0.69679093561701722,89.548135965744734,89.548135965744734,89.548135965744734,""]

{"sheet":" Std Sc. Graph 5","index":12,"n_rows":21,"n_cols":8,"rows_kept":21,"cut":false,"hidden":false,"merged":[[0,2,1,2],[2,1,3,1],[2,4,3,4]]}
[null,null,"Grand  Total"]
[]
[null,"Student Names",{"$f":"'Class 1'!$I$5","v":44.551724137931032},null,"Standard Scores"]
[null,null,{"$f":"'Class 1'!$I$6","v":15.14331429783504}]
[null,{"$f":"'Data Entry'!B73","v":"Belburg, Elise"},{"$f":"'Class 5'!I8","v":35},{"$f":"IF(C5=0,\"\",(C5-$C$3)/$C$4)","v":-0.63075519335265939},{"$f":"100+D5*(15)","v":90.538672099710112},{"$f":"E5","v":90.538672099710112},{"$f":"IF(F5>=85,F5,\"\")","v":90.538672099710112},{"$f":"IF(F5<85,F5,\"\")","v":""}]
[null,{"$f":"'Data Entry'!B74","v":"Brow, Lenny"},{"$f":"'Class 5'!I9","v":15},-1.9514700386398165,{"$f":"100+D6*(15)","v":70.727949420402751},70.727949420402751,{"$f":"IF(F6>=85,F6,\"\")","v":""},{"$f":"IF(F6<85,F6,\"\")","v":70.727949420402751}]
[null,{"$f":"'Data Entry'!B75","v":"Cramer, Sophie"},{"$f":"'Class 5'!I10","v":58},0.8880668787275714,113.32100318091358,113.32100318091358,113.32100318091358,""]
[null,{"$f":"'Data Entry'!B76","v":"Dedrington, Nick"},{"$f":"'Class 5'!I11","v":28},-1.0930053892031644,83.604919161952537,83.604919161952537,"",83.604919161952537]
[null,{"$f":"'Data Entry'!B77","v":"Enns, Benjamin"},{"$f":"'Class 5'!I12","v":32},-0.82886242014573297,87.567063697814007,87.567063697814007,87.567063697814007,""]
[null,{"$f":"'Data Entry'!B78","v":"Passenger, Phoebe"},{"$f":"'Class 5'!I13","v":57},0.82203113646321346,112.3304670469482,112.3304670469482,112.3304670469482,""]
[null,{"$f":"'Data Entry'!B79","v":"Pattern, Viyan"},{"$f":"'Class 5'!I14","v":22},-1.4892198427893115,77.661702358160326,77.661702358160326,"",77.661702358160326]
[null,{"$f":"'Data Entry'!B80","v":"Pries, Nolan"},{"$f":"'Class 5'!I15","v":28},-1.0930053892031644,83.604919161952537,83.604919161952537,"",83.604919161952537]
[null,{"$f":"'Data Entry'!B81","v":"Prodical, Sophie"},{"$f":"'Class 5'!I16","v":43},-0.10246925523779651,98.462961171433051,98.462961171433051,98.462961171433051,""]
[null,{"$f":"'Data Entry'!B82","v":"Rockport, Sandra"},{"$f":"'Class 5'!I17","v":43},-0.10246925523779651,98.462961171433051,98.462961171433051,98.462961171433051,""]
[null,{"$f":"'Data Entry'!B83","v":"Sarkuchi, Danny"},{"$f":"'Class 5'!I18","v":33},-0.76282667788137504,88.55759983177937,88.55759983177937,88.55759983177937,""]
[null,{"$f":"'Data Entry'!B84","v":"Schneider, Lucas"},{"$f":"'Class 5'!I19","v":32},-0.82886242014573297,87.567063697814007,87.567063697814007,87.567063697814007,""]
[null,{"$f":"'Data Entry'!B85","v":"Sellandro, Dennis"},{"$f":"'Class 5'!I20","v":53},0.55788816740578206,108.36832251108673,108.36832251108673,108.36832251108673,""]
[null,{"$f":"'Data Entry'!B86","v":"Wallburg, Rose"},{"$f":"'Class 5'!I21","v":42},-0.16850499750215436,97.472425037467687,97.472425037467687,97.472425037467687,""]
[null,{"$f":"'Data Entry'!B87","v":"Wollmann, Jayson"},{"$f":"'Class 5'!I22","v":29},-1.0269696469388065,84.595455295917901,84.595455295917901,"",84.595455295917901]
[null,{"$f":"'Data Entry'!B88","v":"Wood, Anna"},{"$f":"'Class 5'!I23","v":50},0.35978094061270849,105.39671410919063,105.39671410919063,105.39671410919063,""]
[null,{"$f":"'Data Entry'!B89","v":"Yong, Liam"},{"$f":"'Class 5'!I24","v":67},1.482388559106792,122.23582838660188,122.23582838660188,122.23582838660188,""]

{"sheet":"Division Norms","index":13,"n_rows":29,"n_cols":11,"rows_kept":29,"cut":false,"hidden":false,"merged":[[7,2,7,3],[9,2,9,3],[11,2,11,3],[1,4,3,4],[1,5,3,5],[1,8,3,8],[1,9,3,9],[0,2,0,8],[1,2,3,3],[5,2,5,3],[1,6,3,6],[1,7,3,7],[25,2,25,3],[27,2,27,3],[13,2,13,3],[15,2,15,3],[17,2,17,3],[19,2,19,3],[21,2,21,3],[23,2,23,3]]}
[null,null,"School Division Local Literacy Norms"]
[null,null,"Schools",null,"Blending Syllables","Blending Phonemes","Segmenting Syllables","Segmenting Phonemes","Phonological Memory","Letter Naming Fluency"]
[]
[]
[null,1,"Blumenort School",null,2.5299999999999998,1.67,2.2400000000000002,1.1200000000000001,4.21,31.95,"Means"]
[null,null,null,null,0.02,0.02,0.02,0.02,0.02,4.0199999999999996,"SDs"]
[null,2,"Bothwell School",null,3.57,2.95,1.65,2.4500000000000002,3.57,43.57,"Means"]
[null,null,null,null,0.2,0.2,0.2,0.2,0.2,6.2,"SDs"]
[null,3,"Crystal Springs School",null,1.65,2.5499999999999998,2.2000000000000002,1.5,3.85,51.65,"Means"]
[null,null,null,null,0.04,0.12,0.15,1.23,0.03,8.0399999999999991,"SDs"]
[null,4,"Elmdale School",null,2.4500000000000002,2.95,2.75,1.95,3.5,42.45,"Means"]
[null,null,null,null,0.56000000000000005,0.56000000000000005,0.56000000000000005,0.56000000000000005,0.56000000000000005,0.56000000000000005,"SDs"]
[null,5,"Kleefeld School",null,2.2000000000000002,2.2000000000000002,2.2000000000000002,2.2000000000000002,4.25,45.2,"Means"]
[null,null,null,null,0.92,0.92,0.92,0.92,0.92,10.92,"SDs"]
[null,6,"Landmark Elementary",null,3.9,3.9,3.9,3.9,3.95,33.5,"Means"]
[null,null,null,null,0.85,0.85,0.85,0.85,0.85,0.85,"SDs"]
[null,7,"Mitchell Elementary",null,4.32,2.8,3.95,3.85,4.32,51.2,"Means"]
[null,null,null,null,0.69,0.69,0.69,0.69,0.69,0.69,"SDs"]
[null,8,"Niverville Elementary",null,1.97,1.97,1.97,1.97,3.25,21.97,"Means"]
[null,null,null,null,0.72,0.72,0.72,0.72,0.72,5.72,"SDs"]
[null,9,"South Oaks School",null,3.24,3.24,3.24,3.24,4.24,53.24,"Means"]
[null,null,null,null,0.25,0.25,0.25,0.25,0.25,10.25,"SDs"]
[null,10,"Southwood School",null,2.4300000000000002,2.4300000000000002,2.4300000000000002,2.4300000000000002,3.43,42.43,"Means"]
[null,null,null,null,0.02,0.02,0.02,0.02,0.02,5.0199999999999996,"SDs"]
[null,11,"Woodlawn School",null,1.69,1.69,1.69,1.69,3.69,51.69,"Means"]
[null,null,null,null,".1.1",".1.1",".1.1",".1.1",".1.1",12.1,"SDs"]
[null,null,null,"Grand Means: ",{"$f":"AVERAGE(E5,E7,E9,E11,E13,E15,E17,E19,E21,E23,E25)","v":2.7227272727272727},2.5772727272727272,2.5654545454545459,2.3909090909090911,3.8418181818181818,42.622727272727275]
[null,null,"Standard Deviations: ",null,{"$f":"AVERAGE(E6,E8,E10,E12,E14,E16,E18,E20,E22,E24,E26)","v":0.42699999999999994},{"$f":"AVERAGE(F6,F8,F10,F12,F14,F16,F18,F20,F22,F24,F26)","v":0.43499999999999994},0.438,0.54599999999999993,0.42599999999999999,5.8518181818181807]
[null,null,null,"Cut-Off Scores: ",{"$f":"(E27-E28)","v":2.2957272727272726},{"$f":"(F27-F28)","v":2.1422727272727271},2.1274545454545457,1.8449090909090913,3.4158181818181816,36.770909090909093]

{"sheet":"Schools x Skills","index":14,"n_rows":40,"n_cols":9,"rows_kept":40,"cut":false,"hidden":false,"merged":[[18,1,18,2],[1,1,3,2],[1,3,3,3],[1,4,3,4],[1,5,3,5],[1,8,3,8],[6,1,6,2],[9,1,9,2],[12,1,12,2],[15,1,15,2],[1,6,3,6],[1,7,3,7],[36,1,36,2],[21,1,21,2],[24,1,24,2],[27,1,27,2],[30,1,30,2],[33,1,33,2],[35,1,35,2]]}
[]
[null,"Schools",null,"Blending Syllables","Blending Phonemes","Segmenting Syllables","Segmenting Phonemes","Phonological Memory","Letter Naming Fluency"]
[]
[]
[1,"Blumenort School",null,{"$f":"'Division Norms'!E5","v":2.5299999999999998},{"$f":"'Division Norms'!F5","v":1.67},{"$f":"'Division Norms'!G5","v":2.2400000000000002},{"$f":"'Division Norms'!H5","v":1.1200000000000001},{"$f":"'Division Norms'!I5","v":4.21},{"$f":"'Division Norms'!J5","v":31.95}]
[null,null,null,{"$f":"(D5-D39)/D40","v":-0.45135192676176322},{"$f":"(E5-E39)/E40","v":-2.0856844305120168},-0.74304690743046953,-2.3276723276723281,0.86427656850192058,-1.8238309771632757]
[null,"Std Scores",null,{"$f":"100+D6*15","v":93.229721098573549},{"$f":"100+E6*15","v":68.714733542319749},88.854296388542963,65.084915084915082,112.96414852752881,72.642535342550872]
[2,"Bothwell School",null,{"$f":"'Division Norms'!E7","v":3.57},{"$f":"'Division Norms'!F7","v":2.95},{"$f":"'Division Norms'!G7","v":1.65},{"$f":"'Division Norms'!H7","v":2.4500000000000002},{"$f":"'Division Norms'!I7","v":3.57},{"$f":"'Division Norms'!J7","v":43.57}]
[null,null,null,{"$f":"(D8-D39)/D40","v":1.9842452629337877},{"$f":"(E8-E39)/E40","v":0.85684430512016796},-2.0900788709007898,0.10822510822510822,-0.63807084933845537,0.16187665061363962]
[null,"Std Scores",null,{"$f":"100+D9*15","v":129.76367894400681},{"$f":"100+E9*15","v":112.85266457680252},68.648816936488146,101.62337662337663,90.428937259923174,102.4281497592046]
[3,"Crystal Springs School",null,{"$f":"'Division Norms'!E9","v":1.65},{"$f":"'Division Norms'!F9","v":2.5499999999999998},{"$f":"'Division Norms'!G9","v":2.2000000000000002},{"$f":"'Division Norms'!H9","v":1.5},{"$f":"'Division Norms'!I9","v":3.85},{"$f":"'Division Norms'!J9","v":51.65}]
[null,null,null,{"$f":"(D11-D39)/D40","v":-2.512241856504152},{"$f":"(E11-E39)/E40","v":-6.2695924764890443E-2},-0.83437110834371164,-1.6317016317016322,1.9206145966709602E-2,1.5426440888612705]
[null,"Std Scores",null,{"$f":"100+D12*15","v":62.316372152437722},{"$f":"100+E12*15","v":99.059561128526639},87.484433374844329,75.52447552447552,100.28809218950065,123.13966133291906]
[4,"Elmdale School",null,{"$f":"'Division Norms'!E11","v":2.4500000000000002},{"$f":"'Division Norms'!F11","v":2.95},{"$f":"'Division Norms'!G11","v":2.75},{"$f":"'Division Norms'!H11","v":1.95},{"$f":"'Division Norms'!I11","v":3.5},{"$f":"'Division Norms'!J11","v":42.45}]
[null,null,null,{"$f":"(D14-D39)/D40","v":-0.63870555673834317},{"$f":"(E14-E39)/E40","v":0.85684430512016796},0.42133665421336558,-0.80752580752580805,-0.80239009816474605,-2.9516855678110795E-2]
[null,"Std Scores",null,{"$f":"100+D15*15","v":90.419416648924852},{"$f":"100+E15*15","v":112.85266457680252},106.32004981320048,87.887112887112878,87.964148527528806,99.55724716482834]
[5,"Kleefeld School",null,{"$f":"'Division Norms'!E13","v":2.2000000000000002},{"$f":"'Division Norms'!F13","v":2.2000000000000002},{"$f":"'Division Norms'!G13","v":2.2000000000000002},{"$f":"'Division Norms'!H13","v":2.2000000000000002},{"$f":"'Division Norms'!I13","v":4.25},{"$f":"'Division Norms'!J13","v":45.2}]
[null,null,null,{"$f":"(D17-D39)/D40","v":-1.2241856504151583},{"$f":"(E17-E39)/E40","v":-0.86729362591431503},-0.83437110834371164,-0.34965034965034969,0.95817328211694419,0.44042255709181316]
[null,"Std Scores",null,{"$f":"100+D18*15","v":81.63721524377263},{"$f":"100+E18*15","v":86.990595611285272},87.484433374844329,94.75524475524476,114.37259923175417,106.60633835637719]
[6,"Landmark Elementary",null,{"$f":"'Division Norms'!E15","v":3.9},{"$f":"'Division Norms'!F15","v":3.9},{"$f":"'Division Norms'!G15","v":3.9},{"$f":"'Division Norms'!H15","v":3.9},{"$f":"'Division Norms'!I15","v":3.95},{"$f":"'Division Norms'!J15","v":33.5}]
[null,null,null,{"$f":"(D20-D39)/D40","v":2.7570789865871839},{"$f":"(E20-E39)/E40","v":3.0407523510971792},3.0469074304690733,2.7639027639027636,0.25394793000426852,-1.5589560354202274]
[null,"Std Scores",null,{"$f":"100+D21*15","v":141.35618479880776},{"$f":"100+E21*15","v":145.61128526645768},145.70361145703609,141.45854145854145,103.80921895006402,76.615659468696592]
[7,"Mitchell Elementary",null,{"$f":"'Division Norms'!E17","v":4.32},{"$f":"'Division Norms'!F17","v":2.8},{"$f":"'Division Norms'!G17","v":3.95},{"$f":"'Division Norms'!H17","v":3.85},{"$f":"'Division Norms'!I17","v":4.32},{"$f":"'Division Norms'!J17","v":51.2}]
[null,null,null,{"$f":"(D23-D39)/D40","v":3.7406855439642337},{"$f":"(E23-E39)/E40","v":0.51201671891327061},3.1610626816106264,2.6723276723276723,1.1224925309432359,1.4657449122261927]
[null,"Std Scores",null,{"$f":"100+D24*15","v":156.11028315946351},{"$f":"100+E24*15","v":107.68025078369907},147.41594022415939,140.08491508491508,116.83738796414853,121.98617368339289]
[8,"Niverville Elementary",null,{"$f":"'Division Norms'!E19","v":1.97},{"$f":"'Division Norms'!F19","v":1.97},{"$f":"'Division Norms'!G19","v":1.97},{"$f":"'Division Norms'!H19","v":1.97},{"$f":"'Division Norms'!I19","v":3.25},{"$f":"'Division Norms'!J19","v":21.97}]
[null,null,null,{"$f":"(D26-D39)/D40","v":-1.7628273365978286},{"$f":"(E26-E39)/E40","v":-1.3960292580982236},-1.3594852635948536,-0.77089577089577144,-1.3892445582586428,-3.5292838278701271]
[null,"Std Scores",null,{"$f":"100+D27*15","v":73.557589951032568},{"$f":"100+E27*15","v":79.059561128526639},79.607721046077188,88.436563436563432,79.161331626120358,47.060742581948091]
[9,"South Oaks School",null,{"$f":"'Division Norms'!E21","v":3.24},{"$f":"'Division Norms'!F21","v":3.24},{"$f":"'Division Norms'!G21","v":3.24},{"$f":"'Division Norms'!H21","v":3.24},{"$f":"'Division Norms'!I21","v":4.24},{"$f":"'Division Norms'!J21","v":53.24}]
[null,null,null,{"$f":"(D29-D39)/D40","v":1.2114115392803926},{"$f":"(E29-E39)/E40","v":1.5235109717868347},1.5400581154005806,1.5551115551115553,0.93469910371318876,1.8143545129718817]
[null,"Std Scores",null,{"$f":"100+D30*15","v":118.17117308920589},{"$f":"100+E30*15","v":122.85266457680252},123.10087173100871,123.32667332667333,114.02048655569783,127.21531769457823]
[10,"Southwood School",null,{"$f":"'Division Norms'!E23","v":2.4300000000000002},{"$f":"'Division Norms'!F23","v":2.4300000000000002},{"$f":"'Division Norms'!G23","v":2.4300000000000002},{"$f":"'Division Norms'!H23","v":2.4300000000000002},{"$f":"'Division Norms'!I23","v":3.43},{"$f":"'Division Norms'!J23","v":42.43}]
[null,null,null,{"$f":"(D32-D39)/D40","v":-0.68554396423248842},{"$f":"(E32-E39)/E40","v":-0.33855799373040696},-0.30925695309257012,7.1595071595071558E-2,-0.96670934699103672,-3.2934596861892595E-2]
[null,"Std Scores",null,{"$f":"100+D33*15","v":89.716840536512677},{"$f":"100+E33*15","v":94.921630094043891},95.361145703611442,101.07392607392607,85.499359795134453,99.505981047071614]
[11,"Woodlawn School",null,{"$f":"'Division Norms'!E25","v":1.69},{"$f":"'Division Norms'!F25","v":1.69},{"$f":"'Division Norms'!G25","v":1.69},{"$f":"'Division Norms'!H25","v":1.69},{"$f":"'Division Norms'!I25","v":3.69},{"$f":"'Division Norms'!J25","v":51.69}]
[null,null,null,{"$f":"(D35-D39)/D40","v":-2.4185650415158615},{"$f":"(E35-E39)/E40","v":-2.039707419017764},-1.9987546699875478,-1.2837162837162843,-0.35638070849338466,1.549479571228833]
[null,"Std Scores",null,{"$f":"100+D36*15","v":63.721524377262078},{"$f":"100+E36*15","v":69.404388714733543},70.01867995018678,80.744255744255739,94.654289372599237,123.2421935684325]
[]
[null,null,"Grand Means",{"$f":"'Division Norms'!E27","v":2.7227272727272727},{"$f":"'Division Norms'!F27","v":2.5772727272727272},{"$f":"'Division Norms'!G27","v":2.5654545454545459},{"$f":"'Division Norms'!H27","v":2.3909090909090911},{"$f":"'Division Norms'!I27","v":3.8418181818181818},{"$f":"'Division Norms'!J27","v":42.622727272727275}]
[null,null,"Grand SDs",{"$f":"'Division Norms'!E28","v":0.42699999999999994},{"$f":"'Division Norms'!F28","v":0.43499999999999994},{"$f":"'Division Norms'!G28","v":0.438},{"$f":"'Division Norms'!H28","v":0.54599999999999993},{"$f":"'Division Norms'!I28","v":0.42599999999999999},{"$f":"'Division Norms'!J28","v":5.8518181818181807}]

{"sheet":"Skills x Schools","index":15,"n_rows":40,"n_cols":9,"rows_kept":40,"cut":false,"hidden":false,"merged":[[36,1,36,2],[30,1,30,2],[21,1,21,2],[24,1,24,2],[27,1,27,2],[33,1,33,2],[35,1,35,2],[1,8,3,8],[6,1,6,2],[9,1,9,2],[12,1,12,2],[15,1,15,2],[1,6,3,6],[1,7,3,7],[18,1,18,2],[1,1,3,2],[1,3,3,3],[1,4,3,4],[1,5,3,5]]}
[]
[null,"Schools",null,"Blending Syllables","Blending Phonemes","Segmenting Syllables","Segmenting Phonemes","Phonological Memory","Letter Naming Fluency"]
[]
[]
[1,"Blumenort School",null,{"$f":"'Division Norms'!E5","v":2.5299999999999998},{"$f":"'Division Norms'!F5","v":1.67},{"$f":"'Division Norms'!G5","v":2.2400000000000002},{"$f":"'Division Norms'!H5","v":1.1200000000000001},{"$f":"'Division Norms'!I5","v":4.21},{"$f":"'Division Norms'!J5","v":31.95}]
[null,null,null,{"$f":"(D5-D39)/D40","v":-0.45135192676176322},{"$f":"(E5-E39)/E40","v":-2.0856844305120168},-0.74304690743046953,-2.3276723276723281,0.86427656850192058,-1.8238309771632757]
[null,"Std Scores",null,{"$f":"100+D6*15","v":93.229721098573549},{"$f":"100+E6*15","v":68.714733542319749},88.854296388542963,65.084915084915082,112.96414852752881,72.642535342550872]
[2,"Bothwell School",null,{"$f":"'Division Norms'!E7","v":3.57},{"$f":"'Division Norms'!F7","v":2.95},{"$f":"'Division Norms'!G7","v":1.65},{"$f":"'Division Norms'!H7","v":2.4500000000000002},{"$f":"'Division Norms'!I7","v":3.57},{"$f":"'Division Norms'!J7","v":43.57}]
[null,null,null,{"$f":"(D8-D39)/D40","v":1.9842452629337877},{"$f":"(E8-E39)/E40","v":0.85684430512016796},-2.0900788709007898,0.10822510822510822,-0.63807084933845537,0.16187665061363962]
[null,"Std Scores",null,{"$f":"100+D9*15","v":129.76367894400681},{"$f":"100+E9*15","v":112.85266457680252},68.648816936488146,101.62337662337663,90.428937259923174,102.4281497592046]
[3,"Crystal Springs School",null,{"$f":"'Division Norms'!E9","v":1.65},{"$f":"'Division Norms'!F9","v":2.5499999999999998},{"$f":"'Division Norms'!G9","v":2.2000000000000002},{"$f":"'Division Norms'!H9","v":1.5},{"$f":"'Division Norms'!I9","v":3.85},{"$f":"'Division Norms'!J9","v":51.65}]
[null,null,null,{"$f":"(D11-D39)/D40","v":-2.512241856504152},{"$f":"(E11-E39)/E40","v":-6.2695924764890443E-2},-0.83437110834371164,-1.6317016317016322,1.9206145966709602E-2,1.5426440888612705]
[null,"Std Scores",null,{"$f":"100+D12*15","v":62.316372152437722},{"$f":"100+E12*15","v":99.059561128526639},87.484433374844329,75.52447552447552,100.28809218950065,123.13966133291906]
[4,"Elmdale School",null,{"$f":"'Division Norms'!E11","v":2.4500000000000002},{"$f":"'Division Norms'!F11","v":2.95},{"$f":"'Division Norms'!G11","v":2.75},{"$f":"'Division Norms'!H11","v":1.95},{"$f":"'Division Norms'!I11","v":3.5},{"$f":"'Division Norms'!J11","v":42.45}]
[null,null,null,{"$f":"(D14-D39)/D40","v":-0.63870555673834317},{"$f":"(E14-E39)/E40","v":0.85684430512016796},0.42133665421336558,-0.80752580752580805,-0.80239009816474605,-2.9516855678110795E-2]
[null,"Std Scores",null,{"$f":"100+D15*15","v":90.419416648924852},{"$f":"100+E15*15","v":112.85266457680252},106.32004981320048,87.887112887112878,87.964148527528806,99.55724716482834]
[5,"Kleefeld School",null,{"$f":"'Division Norms'!E13","v":2.2000000000000002},{"$f":"'Division Norms'!F13","v":2.2000000000000002},{"$f":"'Division Norms'!G13","v":2.2000000000000002},{"$f":"'Division Norms'!H13","v":2.2000000000000002},{"$f":"'Division Norms'!I13","v":4.25},{"$f":"'Division Norms'!J13","v":45.2}]
[null,null,null,{"$f":"(D17-D39)/D40","v":-1.2241856504151583},{"$f":"(E17-E39)/E40","v":-0.86729362591431503},-0.83437110834371164,-0.34965034965034969,0.95817328211694419,0.44042255709181316]
[null,"Std Scores",null,{"$f":"100+D18*15","v":81.63721524377263},{"$f":"100+E18*15","v":86.990595611285272},87.484433374844329,94.75524475524476,114.37259923175417,106.60633835637719]
[6,"Landmark Elementary",null,{"$f":"'Division Norms'!E15","v":3.9},{"$f":"'Division Norms'!F15","v":3.9},{"$f":"'Division Norms'!G15","v":3.9},{"$f":"'Division Norms'!H15","v":3.9},{"$f":"'Division Norms'!I15","v":3.95},{"$f":"'Division Norms'!J15","v":33.5}]
[null,null,null,{"$f":"(D20-D39)/D40","v":2.7570789865871839},{"$f":"(E20-E39)/E40","v":3.0407523510971792},3.0469074304690733,2.7639027639027636,0.25394793000426852,-1.5589560354202274]
[null,"Std Scores",null,{"$f":"100+D21*15","v":141.35618479880776},{"$f":"100+E21*15","v":145.61128526645768},145.70361145703609,141.45854145854145,103.80921895006402,76.615659468696592]
[7,"Mitchell Elementary",null,{"$f":"'Division Norms'!E17","v":4.32},{"$f":"'Division Norms'!F17","v":2.8},{"$f":"'Division Norms'!G17","v":3.95},{"$f":"'Division Norms'!H17","v":3.85},{"$f":"'Division Norms'!I17","v":4.32},{"$f":"'Division Norms'!J17","v":51.2}]
[null,null,null,{"$f":"(D23-D39)/D40","v":3.7406855439642337},{"$f":"(E23-E39)/E40","v":0.51201671891327061},3.1610626816106264,2.6723276723276723,1.1224925309432359,1.4657449122261927]
[null,"Std Scores",null,{"$f":"100+D24*15","v":156.11028315946351},{"$f":"100+E24*15","v":107.68025078369907},147.41594022415939,140.08491508491508,116.83738796414853,121.98617368339289]
[8,"Niverville Elementary",null,{"$f":"'Division Norms'!E19","v":1.97},{"$f":"'Division Norms'!F19","v":1.97},{"$f":"'Division Norms'!G19","v":1.97},{"$f":"'Division Norms'!H19","v":1.97},{"$f":"'Division Norms'!I19","v":3.25},{"$f":"'Division Norms'!J19","v":21.97}]
[null,null,null,{"$f":"(D26-D39)/D40","v":-1.7628273365978286},{"$f":"(E26-E39)/E40","v":-1.3960292580982236},-1.3594852635948536,-0.77089577089577144,-1.3892445582586428,-3.5292838278701271]
[null,"Std Scores",null,{"$f":"100+D27*15","v":73.557589951032568},{"$f":"100+E27*15","v":79.059561128526639},79.607721046077188,88.436563436563432,79.161331626120358,47.060742581948091]
[9,"South Oaks School",null,{"$f":"'Division Norms'!E21","v":3.24},{"$f":"'Division Norms'!F21","v":3.24},{"$f":"'Division Norms'!G21","v":3.24},{"$f":"'Division Norms'!H21","v":3.24},{"$f":"'Division Norms'!I21","v":4.24},{"$f":"'Division Norms'!J21","v":53.24}]
[null,null,null,{"$f":"(D29-D39)/D40","v":1.2114115392803926},{"$f":"(E29-E39)/E40","v":1.5235109717868347},1.5400581154005806,1.5551115551115553,0.93469910371318876,1.8143545129718817]
[null,"Std Scores",null,{"$f":"100+D30*15","v":118.17117308920589},{"$f":"100+E30*15","v":122.85266457680252},123.10087173100871,123.32667332667333,114.02048655569783,127.21531769457823]
[10,"Southwood School",null,{"$f":"'Division Norms'!E23","v":2.4300000000000002},{"$f":"'Division Norms'!F23","v":2.4300000000000002},{"$f":"'Division Norms'!G23","v":2.4300000000000002},{"$f":"'Division Norms'!H23","v":2.4300000000000002},{"$f":"'Division Norms'!I23","v":3.43},{"$f":"'Division Norms'!J23","v":42.43}]
[null,null,null,{"$f":"(D32-D39)/D40","v":-0.68554396423248842},{"$f":"(E32-E39)/E40","v":-0.33855799373040696},-0.30925695309257012,7.1595071595071558E-2,-0.96670934699103672,-3.2934596861892595E-2]
[null,"Std Scores",null,{"$f":"100+D33*15","v":89.716840536512677},{"$f":"100+E33*15","v":94.921630094043891},95.361145703611442,101.07392607392607,85.499359795134453,99.505981047071614]
[11,"Woodlawn School",null,{"$f":"'Division Norms'!E25","v":1.69},{"$f":"'Division Norms'!F25","v":1.69},{"$f":"'Division Norms'!G25","v":1.69},{"$f":"'Division Norms'!H25","v":1.69},{"$f":"'Division Norms'!I25","v":3.69},{"$f":"'Division Norms'!J25","v":51.69}]
[null,null,null,{"$f":"(D35-D39)/D40","v":-2.4185650415158615},{"$f":"(E35-E39)/E40","v":-2.039707419017764},-1.9987546699875478,-1.2837162837162843,-0.35638070849338466,1.549479571228833]
[null,"Std Scores",null,{"$f":"100+D36*15","v":63.721524377262078},{"$f":"100+E36*15","v":69.404388714733543},70.01867995018678,80.744255744255739,94.654289372599237,123.2421935684325]
[]
[null,null,"Grand Means",{"$f":"'Division Norms'!E27","v":2.7227272727272727},{"$f":"'Division Norms'!F27","v":2.5772727272727272},{"$f":"'Division Norms'!G27","v":2.5654545454545459},{"$f":"'Division Norms'!H27","v":2.3909090909090911},{"$f":"'Division Norms'!I27","v":3.8418181818181818},{"$f":"'Division Norms'!J27","v":42.622727272727275}]
[null,null,"Grand SDs",{"$f":"'Division Norms'!E28","v":0.42699999999999994},{"$f":"'Division Norms'!F28","v":0.43499999999999994},{"$f":"'Division Norms'!G28","v":0.438},{"$f":"'Division Norms'!H28","v":0.54599999999999993},{"$f":"'Division Norms'!I28","v":0.42599999999999999},{"$f":"'Division Norms'!J28","v":5.8518181818181807}]