{"text_format":"1","workbook":"xlsx","n_sheets":12,"sheets":["FSA Introduction","Classroom Data Entry","CF Clusters Chart","CF Elem. Chart","EA Support Chart","CF Per Subject Chart","Ave. CF Chart","Well-Being Data Entry","Peer Functioning","Class Data - Pre&Post","ELA Graph - Pre&Post","Math Graph - Pre&Post"],"not_rendered":{"charts":17,"images":9,"macros":1,"external_links":0,"defined_names":6,"comments":0,"pivot_tables":0},"unopened":[],"bounds":{"document_bytes":16777216,"sheet_cells":100000,"rows_first":2000,"rows_last":500,"rows_between":2000,"halvings":0,"cell_chars":16384,"cell_head_chars":4096},"cells_cut":0,"cells_raw":0,"read":"whole","date_system":"1900"}

{"sheet":"FSA Introduction","index":0,"n_rows":0,"n_cols":0,"rows_kept":0,"cut":false,"hidden":false,"merged":[]}

{"sheet":"Classroom Data Entry","index":1,"n_rows":29,"n_cols":15,"rows_kept":29,"cut":false,"hidden":false,"merged":[[0,5,0,6],[25,3,25,4],[25,0,25,2],[23,0,23,2],[24,0,24,2],[0,1,0,2],[0,3,0,4]]}
[null,"Elementary Teacher",null,"Middle School",null,"Additional Raters"]
["Classroom Functioning Skills","Independent","With EA help","ELA/SS","Math/Sci.",null,null,"Average","Total Mean","Ind. Mean","With Help Mean","Skill Clusters","Average","Percentage","Ave. Line"]
["Attends class daily",null,null,5,5,null,null,{"$f":"AVERAGEIF(B3:G3,\">0\")","v":5},{"$f":"$H$23","v":2.9750000000000001},{"$f":"$B$23","v":0},{"$f":"'Classroom Data Entry'!$C$23","v":0},"Oral Communication",{"$f":"AVERAGE(H7:H8)","v":3.75},{"$f":"(M3-1)/4*100","v":68.75},{"$f":"$N$10","v":49.375}]
["Arrives on time",null,null,4,4,null,null,4,2.9750000000000001,0,{"$f":"'Classroom Data Entry'!$C$23","v":0},"Reading Competencies",{"$f":"AVERAGE(H9:H10)","v":2.5},37.5,49.375]
["Follows routines",null,null,3,3,null,null,3,2.9750000000000001,0,{"$f":"'Classroom Data Entry'!$C$23","v":0},"Writing Competencies",{"$f":"AVERAGE(H11:H12)","v":2},{"$f":"(M5-1)/4*100","v":25},49.375]
["Attends to lessons",null,null,2,3,null,null,2.5,2.9750000000000001,0,{"$f":"'Classroom Data Entry'!$C$23","v":0},"Math Competencies",{"$f":"AVERAGE(H13:H14)","v":3.5},{"$f":"(M6-1)/4*100","v":62.5},49.375]
["Asks/answers questions",null,null,4,4,null,null,4,2.9750000000000001,0,{"$f":"'Classroom Data Entry'!$C$23","v":0},"Executive Functioning",{"$f":"(H6+H15+ H16+H17+H19)/5","v":2.6},{"$f":"(M7-1)/4*100","v":40},49.375]
["Participates in discussions",null,null,3,4,null,null,3.5,2.9750000000000001,0,{"$f":"'Classroom Data Entry'!$C$23","v":0},"Memory Functioning",{"$f":"(H15+H18)/2","v":2.75},{"$f":"(M8-1)/4*100","v":43.75},49.375]
["Reads aloud accurately",null,null,2,2,null,null,2,2.9750000000000001,0,{"$f":"'Classroom Data Entry'!$C$23","v":0},"Cooperative Behavior",{"$f":"AVERAGE(H20:H22)","v":2.6666666666666665},{"$f":"(M9-1)/4*100","v":41.666666666666664}]
["Understands what is read",null,null,3,3,null,null,3,2.9750000000000001,null,null,"Total Functioning",{"$f":"H23","v":2.9750000000000001},{"$f":"(H23-1)/4*100","v":49.375}]
["Writes clearly",null,null,1,2,null,null,1.5,2.9750000000000001,{"$f":"$B$23","v":0},{"$f":"'Classroom Data Entry'!$C$23","v":0}]
["Writes neatly",null,null,3,2,null,null,2.5,2.9750000000000001,{"$f":"$B$23","v":0},{"$f":"'Classroom Data Entry'!$C$23","v":0}]
["Calculates accurately",null,null,null,4,null,null,4,2.9750000000000001,{"$f":"$B$23","v":0},{"$f":"'Classroom Data Entry'!$C$23","v":0}]
["Solves math problems",null,null,null,3,null,null,3,2.9750000000000001]
["Follows instructions",null,null,2,3,null,null,2.5,2.9750000000000001,{"$f":"$B$23","v":0},{"$f":"'Classroom Data Entry'!$C$23","v":0}]
["Stays on task",null,null,2,3,null,null,2.5,2.9750000000000001,0,{"$f":"'Classroom Data Entry'!$C$23","v":0}]
["Completes assignments",null,null,2,3,null,null,2.5,2.9750000000000001,0,{"$f":"'Classroom Data Entry'!$C$23","v":0}]
["Remembers concepts",null,null,2,4,null,null,3,2.9750000000000001,0,{"$f":"'Classroom Data Entry'!$C$23","v":0}]
["Keeps materials organized",null,null,1,5,null,null,3,2.9750000000000001,0,{"$f":"'Classroom Data Entry'!$C$23","v":0}]
["Follows rules",null,null,3,4,null,null,3.5,2.9750000000000001,0,{"$f":"'Classroom Data Entry'!$C$23","v":0}]
["Complies with adults",null,null,2,4,null,null,3,2.9750000000000001,0,{"$f":"'Classroom Data Entry'!$C$23","v":0}]
["Contributes in groups",null,null,1,2,null,null,1.5,2.9750000000000001,0,{"$f":"'Classroom Data Entry'!$C$23","v":0}]
["Total Classroom Functioning ",{"$f":"SUM(B3:B22)/COUNTIF(B3:B22,\"<>0\")","v":0},{"$f":"SUM(C3:C22)/COUNTIF(C3:C22,\"<>0\")","v":0},{"$f":"SUM(D3:D22)/COUNTIF(D3:D22,\"<>0\")","v":2.25},{"$f":"SUM(E3:E22)/COUNTIF(E3:E22,\"<>0\")","v":3.35},0,0,{"$f":"SUM(H3:H22)/COUNTIF(H3:H22,\">0\")","v":2.9750000000000001}]
["EAL/SS Percentage: ",null,null,{"$f":"(D23-1)/4*100","v":31.25},null,{"$f":"(F23-1)/4*100","v":-25},null,{"$f":"_xlfn.STDEV.S(H3:H22)","v":0.8656454847471674}]
["Math/Sci. Percentage: ",null,null,null,{"$f":"(E23-1)/4*100","v":58.75},null,{"$f":"(G23-1)/4*100","v":-25},{"$f":"MAX(H3:H22)","v":5}]
["Correlation - ELA/SS vs. Math/Sci: ",null,null,{"$f":"CORREL(D3:D22,E3:E22)","v":0.44172610429938608},null,null,null,{"$f":"MIN(H3:H22)","v":1.5}]
[null,null,null,null,null,null,null,{"$f":"(H25-H26)","v":3.5}]
[null,null,null,null,null,null,null,{"$f":"MEDIAN(H3:H22)","v":3}]
[null,"Brian Anderson"]

{"sheet":"CF Clusters Chart","index":2,"n_rows":25,"n_cols":13,"rows_kept":25,"cut":false,"hidden":false,"merged":[[24,17,24,18],[26,16,26,17],[25,16,25,17]]}
[]
[]
[]
[]
[]
[]
[]
[]
[]
[]
[]
[]
[]
[]
[]
[]
[]
[]
[]
[]
[]
[]
[]
[]
[null,null,null,null,null,null,null,null,null,null,null,null,{"$f":"'Classroom Data Entry'!$B$29","v":"Brian Anderson"}]

{"sheet":"CF Elem. Chart","index":3,"n_rows":0,"n_cols":0,"rows_kept":0,"cut":false,"hidden":false,"merged":[]}

{"sheet":"EA Support Chart","index":4,"n_rows":0,"n_cols":0,"rows_kept":0,"cut":false,"hidden":false,"merged":[]}

{"sheet":"CF Per Subject Chart","index":5,"n_rows":25,"n_cols":23,"rows_kept":25,"cut":false,"hidden":false,"merged":[]}
[]
[]
[]
[]
[]
[]
[]
[]
[]
[]
[]
[]
[]
[]
[]
[]
[]
[]
[]
[]
[]
[]
[]
[]
[null,null,null,null,null,null,null,null,null,null,null,null,null,null,null,{"$f":"'Classroom Data Entry'!$D$24/100","v":0.3125},null,{"$f":"'Classroom Data Entry'!$E$25/100","v":0.58750000000000002},null,null,{"$f":"'Classroom Data Entry'!$F$24/100","v":-0.25},null,{"$f":"'Classroom Data Entry'!$G$25/100","v":-0.25}]

{"sheet":"Ave. CF Chart","index":6,"n_rows":24,"n_cols":16,"rows_kept":24,"cut":false,"hidden":false,"merged":[]}
[]
[]
[]
[]
[null,null,null,null,null,null,null,null,null,null,null,null,null,null,null,{"$f":"'Classroom Data Entry'!$B$29","v":"Brian Anderson"}]
[null,null,null,null,null,null,null,null,null,null,null,null,null,null,null,"Significant Problems"]
[null,null,null,null,null,null,null,null,null,null,null,null,null,null,null,{"$f":" IF(('Classroom Data Entry'!H3 < 3),('Classroom Data Entry'!A3), \"\")","v":""}]
[null,null,null,null,null,null,null,null,null,null,null,null,null,null,null,{"$f":" IF(('Classroom Data Entry'!H4 < 3),('Classroom Data Entry'!A4), \"\")","v":""}]
[null,null,null,null,null,null,null,null,null,null,null,null,null,null,null,{"$f":" IF(('Classroom Data Entry'!H5 < 3),('Classroom Data Entry'!A5), \"\")","v":""}]
[null,null,null,null,null,null,null,null,null,null,null,null,null,null,null,{"$f":" IF(('Classroom Data Entry'!H6 < 3),('Classroom Data Entry'!A6), \"\")","v":"Attends to lessons"}]
[null,null,null,null,null,null,null,null,null,null,null,null,null,null,null,{"$f":" IF(('Classroom Data Entry'!H7 < 3),('Classroom Data Entry'!A7), \"\")","v":""}]
[null,null,null,null,null,null,null,null,null,null,null,null,null,null,null,{"$f":" IF(('Classroom Data Entry'!H8 < 3),('Classroom Data Entry'!A8), \"\")","v":""}]
[null,null,null,null,null,null,null,null,null,null,null,null,null,null,null,{"$f":" IF(('Classroom Data Entry'!H9 < 3),('Classroom Data Entry'!A9), \"\")","v":"Reads aloud accurately"}]
[null,null,null,null,null,null,null,null,null,null,null,null,null,null,null,{"$f":" IF(('Classroom Data Entry'!H11 < 3),('Classroom Data Entry'!A11), \"\")","v":"Writes clearly"}]
[null,null,null,null,null,null,null,null,null,null,null,null,null,null,null,{"$f":" IF(('Classroom Data Entry'!H12 < 3),('Classroom Data Entry'!A12), \"\")","v":"Writes neatly"}]
[null,null,null,null,null,null,null,null,null,null,null,null,null,null,null,{"$f":" IF(('Classroom Data Entry'!H13 < 3),('Classroom Data Entry'!A13), \"\")","v":""}]
[null,null,null,null,null,null,null,null,null,null,null,null,null,null,null,{"$f":" IF(('Classroom Data Entry'!H15 < 3),('Classroom Data Entry'!A15), \"\")","v":"Follows instructions"}]
[null,null,null,null,null,null,null,null,null,null,null,null,null,null,null,{"$f":" IF(('Classroom Data Entry'!H16 < 3),('Classroom Data Entry'!A16), \"\")","v":"Stays on task"}]
[null,null,null,null,null,null,null,null,null,null,null,null,null,null,null,{"$f":" IF(('Classroom Data Entry'!H17 < 3),('Classroom Data Entry'!A17), \"\")","v":"Completes assignments"}]
[null,null,null,null,null,null,null,null,null,null,null,null,null,null,null,{"$f":" IF(('Classroom Data Entry'!H18 < 3),('Classroom Data Entry'!A18), \"\")","v":""}]
[null,null,null,null,null,null,{"$f":"'Ave. CF Chart'!P12= IF((G2 < 2.5),(A2), \"\")= IF((G2 < 2.5),(A2), \"\")","v":false},null,null,null,null,null,null,null,null,{"$f":" IF(('Classroom Data Entry'!H19 < 3),('Classroom Data Entry'!A19), \"\")","v":""}]
[null,null,null,null,null,null,null,null,null,null,null,null,null,null,null,{"$f":" IF(('Classroom Data Entry'!H20 < 3),('Classroom Data Entry'!A20), \"\")","v":""}]
[null,null,null,null,null,null,null,null,null,null,null,null,null,null,null,{"$f":" IF(('Classroom Data Entry'!H21 < 3),('Classroom Data Entry'!A21), \"\")","v":""}]
[null,null,null,null,null,null,null,null,null,null,null,null,null,null,null,{"$f":" IF(('Classroom Data Entry'!H22 < 3),('Classroom Data Entry'!A22), \"\")","v":"Contributes in groups"}]

{"sheet":"Well-Being Data Entry","index":7,"n_rows":23,"n_cols":9,"rows_kept":23,"cut":false,"hidden":false,"merged":[[22,0,22,1],[22,2,22,3],[17,2,17,3],[20,2,20,3],[20,0,20,1],[21,2,21,3],[21,0,21,1],[19,2,19,3]]}
["Sense of Well-Being","Elementary","ELA/SS","Math/Sci.","EA","Parent","Average",null,"School Averages"]
["Feels compenent",2,null,null,null,3,{"$f":"AVERAGE(B2:F2)","v":2.5},{"$f":"$G$17","v":3.3333333333333335},{"$f":"AVERAGE(B2:E2)","v":2}]
["Feels loved/accepted",4,null,null,null,5,4.5,3.3333333333333335,{"$f":"AVERAGE(B3:E3)","v":4}]
["Emotionaly stable",4,null,null,null,3,3.5,3.3333333333333335,4]
["Compliments self",1,null,null,null,1,1,3.3333333333333335,1]
["Optimistic / hopeful",2,null,null,null,3,2.5,3.3333333333333335,2]
["Sense of humour",3,null,null,null,3,3,3.3333333333333335,3]
["Anxious / feaful",2,null,null,null,3,2.5,3.3333333333333335,2]
["Angry / irritable",4,null,null,null,3,3.5,3.3333333333333335,4]
["Sad / unhappy",3,null,null,null,2,2.5,3.3333333333333335,3]
["Physically hurts self",5,null,null,null,5,5,3.3333333333333335,5]
["Threans suicide",5,null,null,null,5,5,3.3333333333333335,5]
["Looks tired / yawns",3,null,null,null,3,3,3.3333333333333335,3]
["Feels hungry",4,null,null,null,4,4,3.3333333333333335,4]
["Feels sick / pains",4,null,null,null,4,4,3.3333333333333335,4]
["Puts self down",3,null,null,null,4,3.5,3.3333333333333335,3]
["Ave. Emotional Well-Being",{"$f":"AVERAGE(B2:B16)","v":3.2666666666666666},{"$f":"SUM(C2:C16)/COUNTIF(C2:C16,\">0\")","v":{"$error":"#DIV/0!"}},{"$f":"SUM(D2:D16)/COUNTIF(D2:D16,\">0\")","v":{"$error":"#DIV/0!"}},{"$error":"#DIV/0!"},3.4,3.3333333333333335]
[null,"Teacher Ave.",{"$f":"AVERAGE(C17:D17)","v":{"$error":"#DIV/0!"}},null,null,"Total % Score:",{"$f":"(G17-1)/4*100","v":58.333333333333336}]
[]
[null,"Correlation - Elem Teacher & Parent: ",{"$f":"CORREL(B2:B16,F2:F16)","v":0.78884670837963389}]
["Correlation - ELA and Math: ",null,{"$f":"CORREL(C2:C16,D2:D16)","v":{"$error":"#DIV/0!"}}]
["Correlation - ELA and  Parent: ",null,{"$f":"CORREL(C2:C16,F2:F16)","v":{"$error":"#DIV/0!"}}]
["Correlation - Math and  Parent: ",null,{"$f":"CORREL(D3:D17,F3:F17)","v":{"$error":"#DIV/0!"}}]

{"sheet":"Peer Functioning","index":8,"n_rows":20,"n_cols":9,"rows_kept":20,"cut":false,"hidden":false,"merged":[[19,0,19,1],[19,2,19,3],[14,2,14,3],[17,0,17,1],[17,2,17,3],[18,0,18,1],[18,2,18,3],[16,2,16,3]]}
["Peer Functioning","Elementary","ELA/SS","Math/Sci.","EA","Parent","Average",null,"School Averages"]
["Positive Engagement",3,null,null,null,2,{"$f":"AVERAGE(B2:F2)","v":2.5},{"$f":"$G$14","v":4.041666666666667},{"$f":"AVERAGE(B2:E2)","v":3}]
["Social Problem Soving",2,null,null,null,2,2,4.041666666666667,2]
["Close Friendships",2,null,null,null,3,2.5,4.041666666666667,2]
["Social Acceptance",4,null,null,null,3,3.5,4.041666666666667,4]
["Same-Age Peers",5,null,null,null,5,5,4.041666666666667,5]
["Swears Aloud",5,null,null,null,5,5,4.041666666666667,5]
["Verbally Threatens",4,null,null,null,5,4.5,4.041666666666667,4]
["Destroys Property",5,null,null,null,5,5,4.041666666666667,5]
["Violent Toward Peers",5,null,null,null,5,5,4.041666666666667,5]
["Bullies Other Students",5,null,null,null,5,5,4.041666666666667,5]
["Negative Peer Group",5,null,null,null,5,5,4.041666666666667,5]
["Withdraws from Peers",3,null,null,null,4,3.5,4.041666666666667,3]
["Average Peer Functioning",{"$f":"AVERAGE(B2:B13)","v":4},{"$f":"SUM(C2:C13)/COUNTIF(C2:C13,\">0\")","v":{"$error":"#DIV/0!"}},{"$f":"SUM(D2:D13)/COUNTIF(D2:D13,\">0\")","v":{"$error":"#DIV/0!"}},{"$f":"SUM(E2:E13)/COUNTIF(E2:E13,\">0\")","v":{"$error":"#DIV/0!"}},{"$f":"SUM(F2:F13)/COUNTIF(F2:F13,\">0\")","v":4.083333333333333},{"$f":"SUM(G2:G13)/COUNTIF(G2:G13,\">0\")","v":4.041666666666667}]
[null,"Teacher Ave.",{"$f":"AVERAGE(C14:D14)","v":{"$error":"#DIV/0!"}},null,null,"Total % Score:",{"$f":"(G14-1)/4*100","v":76.041666666666671}]
[]
[null,"Correlation - Elem Teacher & Parent: ",{"$f":"CORREL(B2:B13,F2:F13)","v":0.85096294339676348}]
["Correlation - ELA and Math: ",null,{"$f":"CORREL(C2:C13,D2:D13)","v":{"$error":"#DIV/0!"}}]
["Correlation - ELA and  Parent: ",null,{"$f":"CORREL(C2:C13,F2:F13)","v":{"$error":"#DIV/0!"}}]
["Correlation - Math and  Parent: ",null,{"$f":"CORREL(D2:D13,F2:F13)","v":{"$error":"#DIV/0!"}}]

{"sheet":"Class Data - Pre&Post","index":9,"n_rows":25,"n_cols":11,"rows_kept":25,"cut":false,"hidden":false,"merged":[[21,0,21,5],[21,6,21,7]]}
["Classroom Functioning Skills","Regular - Pre","Pre-Ave.","Regular-Post","Post-Ave.","ELA - Pre","ELA - Post","Math - Pre","Math - post","Average"]
["Attends class daily",{"$f":"'Classroom Data Entry'!B3","v":0},{"$f":"$B$20","v":{"$error":"#DIV/0!"}},5,{"$f":"$D$20","v":3.6111111111111112},{"$f":"'Classroom Data Entry'!D3","v":5},null,{"$f":"'Classroom Data Entry'!E3","v":5},null,{"$f":"AVERAGE(F2:I2)","v":5}]
["Arrives on time",{"$f":"'Classroom Data Entry'!B4","v":0},{"$f":"$B$20","v":{"$error":"#DIV/0!"}},4,{"$f":"$D$20","v":3.6111111111111112},{"$f":"'Classroom Data Entry'!D4","v":4},null,{"$f":"'Classroom Data Entry'!E4","v":4},null,4]
["Follows routines",{"$f":"'Classroom Data Entry'!B5","v":0},{"$error":"#DIV/0!"},4,3.6111111111111112,{"$f":"'Classroom Data Entry'!D5","v":3},null,{"$f":"'Classroom Data Entry'!E5","v":3},null,3]
["Attends to lessons",{"$f":"'Classroom Data Entry'!B6","v":0},{"$error":"#DIV/0!"},4,3.6111111111111112,{"$f":"'Classroom Data Entry'!D6","v":2},null,{"$f":"'Classroom Data Entry'!E6","v":3},null,2.5]
["Asks/answers questions",{"$f":"'Classroom Data Entry'!B7","v":0},{"$error":"#DIV/0!"},3,3.6111111111111112,{"$f":"'Classroom Data Entry'!D7","v":4},null,{"$f":"'Classroom Data Entry'!E7","v":4},null,4]
["Participates in discussions",{"$f":"'Classroom Data Entry'!B8","v":0},{"$error":"#DIV/0!"},4,3.6111111111111112,{"$f":"'Classroom Data Entry'!D8","v":3},null,{"$f":"'Classroom Data Entry'!E8","v":4},null,3.5]
["Reads accurately",{"$f":"'Classroom Data Entry'!B9","v":0},{"$error":"#DIV/0!"},3,3.6111111111111112,{"$f":"'Classroom Data Entry'!D9","v":2},null,{"$f":"'Classroom Data Entry'!E9","v":2},null,2]
["Writes clearly",{"$f":"'Classroom Data Entry'!B11","v":0},{"$error":"#DIV/0!"},2,3.6111111111111112,{"$f":"'Classroom Data Entry'!D11","v":1},null,{"$f":"'Classroom Data Entry'!E11","v":2},null,1.5]
["Writes neatly",{"$f":"'Classroom Data Entry'!B12","v":0},{"$error":"#DIV/0!"},3,3.6111111111111112,{"$f":"'Classroom Data Entry'!D12","v":3},null,{"$f":"'Classroom Data Entry'!E12","v":2},null,2.5]
["Calculates accurately",{"$f":"'Classroom Data Entry'!B13","v":0},{"$error":"#DIV/0!"},4,3.6111111111111112,{"$f":"'Classroom Data Entry'!D13","v":0},null,{"$f":"'Classroom Data Entry'!E13","v":4},null,2]
["Follows instructions",{"$f":"'Classroom Data Entry'!B15","v":0},{"$error":"#DIV/0!"},4,3.6111111111111112,{"$f":"'Classroom Data Entry'!D15","v":2},null,{"$f":"'Classroom Data Entry'!E15","v":3},null,2.5]
["Stays on task",{"$f":"'Classroom Data Entry'!B16","v":0},{"$error":"#DIV/0!"},4,3.6111111111111112,{"$f":"'Classroom Data Entry'!D16","v":2},null,{"$f":"'Classroom Data Entry'!E16","v":3},null,2.5]
["Completes assignments",{"$f":"'Classroom Data Entry'!B17","v":0},{"$error":"#DIV/0!"},4,3.6111111111111112,{"$f":"'Classroom Data Entry'!D17","v":2},null,{"$f":"'Classroom Data Entry'!E17","v":3},null,2.5]
["Remembers concepts",{"$f":"'Classroom Data Entry'!B18","v":0},{"$error":"#DIV/0!"},3,3.6111111111111112,{"$f":"'Classroom Data Entry'!D18","v":2},null,{"$f":"'Classroom Data Entry'!E18","v":4},null,3]
["Keeps materials organized",{"$f":"'Classroom Data Entry'!B19","v":0},{"$error":"#DIV/0!"},3,3.6111111111111112,{"$f":"'Classroom Data Entry'!D19","v":1},null,{"$f":"'Classroom Data Entry'!E19","v":5},null,3]
["Follows rules",{"$f":"'Classroom Data Entry'!B20","v":0},{"$error":"#DIV/0!"},4,3.6111111111111112,{"$f":"'Classroom Data Entry'!D20","v":3},null,{"$f":"'Classroom Data Entry'!E20","v":4},null,3.5]
["Complies with adults",{"$f":"'Classroom Data Entry'!B21","v":0},{"$error":"#DIV/0!"},4,3.6111111111111112,{"$f":"'Classroom Data Entry'!D21","v":2},null,{"$f":"'Classroom Data Entry'!E21","v":4},null,3]
["Cooperates in groups",{"$f":"'Classroom Data Entry'!B22","v":0},{"$error":"#DIV/0!"},3,3.6111111111111112,{"$f":"'Classroom Data Entry'!D22","v":1},null,{"$f":"'Classroom Data Entry'!E22","v":2},null,1.5]
["Total Classroom Functioning",{"$f":"SUM(B2:B19)/COUNTIF(B2:B19,\">0\")","v":{"$error":"#DIV/0!"}},null,3.6111111111111112,null,{"$f":"SUM(F2:F19)/COUNTIF(F2:F19,\">0\")","v":2.4705882352941178},{"$f":"SUM(G2:G19)/COUNTIF(G2:G19,\">0\")","v":{"$error":"#DIV/0!"}},{"$f":"SUM(H2:H19)/COUNTIF(H2:H19,\">0\")","v":3.3888888888888888},{"$error":"#DIV/0!"},{"$f":"SUM(J2:J19)/COUNTIF(J2:J19,\">0\")","v":2.8611111111111112}]
[null,null,null,null,null,null,null,null,null,{"$f":"_xlfn.STDEV.S(J2:J19)","v":0.90432873310336626},"SD"]
["Correlation - ELA/SS and Math/Sci: ",null,null,null,null,null,{"$f":"CORREL(F2:F19,H2:H19)","v":0.32405931476417915},null,null,{"$f":"MAX(J2:J19)","v":5},"Max."]
[null,null,null,null,null,null,null,null,null,{"$f":"MIN(J2:J19)","v":1.5},"Min."]
[null,null,null,"Percentages: ",null,{"$f":"(F20-1)/4*100","v":36.764705882352942},{"$f":"(G20-1)/4*100","v":{"$error":"#DIV/0!"}},59.722222222222221,{"$error":"#DIV/0!"},{"$f":"(J22-J23)","v":3.5},"Range"]
[null,null,null,null,null,null,null,null,null,{"$f":"MEDIAN(J2:J19)","v":2.75},"Median"]

{"sheet":"ELA Graph - Pre&Post","index":10,"n_rows":0,"n_cols":0,"rows_kept":0,"cut":false,"hidden":false,"merged":[]}

{"sheet":"Math Graph - Pre&Post","index":11,"n_rows":0,"n_cols":0,"rows_kept":0,"cut":false,"hidden":false,"merged":[]}