{"text_format":"1","workbook":"xlsx","n_sheets":18,"sheets":["Intro","WISC-V","Step2b","Step3b","Step5","Step6","Step7","Step8","SubtestPerRank","CompositeDescriptorsPerRank","VECINorm","GCK0Norm","EFINorm","GfINorm","WMCNorm","GSPNorm","SUPINorm","SIPINorm"],"not_rendered":{"charts":0,"images":0,"macros":1,"external_links":0,"defined_names":0,"comments":0,"pivot_tables":0},"unopened":[],"bounds":{"document_bytes":16777216,"sheet_cells":100000,"rows_first":2000,"rows_last":500,"rows_between":2000,"halvings":0,"cell_chars":16384,"cell_head_chars":4096},"cells_cut":0,"cells_raw":0,"read":"whole","date_system":"1900"}

{"sheet":"Intro","index":0,"n_rows":37,"n_cols":12,"rows_kept":37,"cut":false,"hidden":false,"merged":[[11,2,11,5],[5,1,5,11],[7,7,7,11],[0,1,0,11],[1,1,1,11],[2,1,2,11],[3,1,3,11],[4,1,4,11]]}
[null,"WISC–V© Interpretive Assistant 1.0"]
[null,"Copyright 2016 © by John Wiley & Sons, Inc. All rights reserved.\n*Wechsler Intelligence Scale for Children, Fifth Edition (WISC-V). Copyright © 2014 NCS Pearson, Inc. \n“Wechsler Intelligence Scale for Children” and “WISC” are trademarks, in the US and/or other countries, of Pearson Education, Inc. or its affiliates(s).\n"]
[null,"Programming by Susan Engi Raiford, PhD\nNorms for Additional Scores by Ou Zhang, PhD and Xuechun Zhou, PhD\nNormative data used by permission. All rights reserved.  "]
[null,"This program is based on Intelligent Testing with the WISC–V"]
[null,"By Alan S. Kaufman, Susan Engi Raiford, and Diane L. Coalson"]
[null,"Users of this program are responsible for following the test publisher's administration and scoring guidelines. That is, all scores entered into this program must be derived from the norms and procedures provided by the test publisher."]
[null,"Directions:"]
[null,"•  Clear previously entered data by clicking on the Clear Data button:"]
[null,"•  Enter child's name, test date, and birth date in cells with red borders below."]
[null,"•  Test Age will automatically populate."]
[null,null,null,null,null,null,null,"mm",null,"dd",null,"yyyy"]
[null,"Child's Name:",null,null,null,null,"Test Date:"]
[]
[null,"Test Age:",{"$f":"ROUNDDOWN(J27,0)","v":0},"Years",{"$f":"ROUNDDOWN(J31,0)&\" Months\"&IF(OR(J27<6,J27>16.9999),\"   OUT OF AGE RANGE!\",\"\")","v":"0 Months   OUT OF AGE RANGE!"},null,"Birth Date:"]
[null,"•  Each interpretive step is listed on a separate tab (click on tabs to move between steps)"]
[null,"•  Enter all of the child's scaled scores into the red boxes on the WISC–V tab."]
[null,"•  The program will automatically calculate all steps for you."]
[]
[]
[null,null,null,null,null,null,null,null,null,"days since 01/01/2000"]
[null,null,null,null,null,null,null,null,null,{"$f":"-((1600*365)+(400*366))+(SUM(L12*365)+(H12*30)+(J12))","v":-730400}]
[null,null,null,null,null,null,null,null,null,"Days between 1/1/2000 and kid's birth"]
[null,null,null,null,null,null,null,null,null,{"$f":"-((1600*365)+(400*366))+(SUM(L14*365)+(H14*30)+(J14))","v":-730400}]
[null,null,null,null,null,null,null,null,null,"ageinDays"]
[null,null,null,null,null,null,null,null,null,{"$f":"J21-J23","v":0}]
[null,null,null,null,null,null,null,null,null,"ageinYears"]
[null,null,null,null,null,null,null,null,null,{"$f":"J25/365","v":0}]
[null,null,null,null,null,null,null,null,null,"leftover fraction of a year"]
[null,null,null,null,null,null,null,null,null,{"$f":"((J25/365)-C14)","v":0}]
[null,null,null,null,null,null,{"$f":"J29*365","v":0},null,null,"months age"]
[null,null,null,null,null,null,null,null,null,{"$f":"(J29*365.25)/(G33/12)","v":0}]
[null,null,null,null,null,null,{"$f":"364","v":364}]
[null,null,null,null,null,null,{"$f":"(7*31)+(4*30)+(28.25)","v":365.25}]
[]
[]
[]
[null,null,null,null,null,null,null,null,null,{"$f":"IF(AND(J27<3,J27>=2.5),1,\"\") &IF(AND(J27<3.5,J27>=3),2,\"\") &IF(AND(J27<4,J27>=3.5),3,\"\")","v":""}]

{"sheet":"WISC-V","index":1,"n_rows":46,"n_cols":5,"rows_kept":46,"cut":false,"hidden":false,"merged":[]}
[null,{"$f":"\"Child's Name: \" &Intro!C12","v":"Child's Name: "},null,null,{"$f":"\"Test Date: \" &Intro!H12 &\"/\" &Intro!J12 &\"/\" & Intro!L12","v":"Test Date: //"}]
[null,{"$f":"\"Test Age: \" &Intro!C14 &\" Years \" &(Intro!E14) &Intro!F14","v":"Test Age: 0 Years 0 Months   OUT OF AGE RANGE!"},null,null,{"$f":"\"Birth Date: \" &Intro!H14 &\"/\" &Intro!J14 &\"/\" &Intro!L14","v":"Birth Date: //"}]
[null,"•  Enter the subtest scaled scores and the composite scores in the white cells."]
[null,"•  The program will automatically calculate the next steps for you."]
[null,"Score","Standard or Scaled Score Value","Percentile \nRank","Descriptive \nCategory"]
[null,"Verbal Comprehension Index",null,{"$f":"VLOOKUP(C6,CompositeDescriptorsPerRank!$A$2:$C$122,3,FALSE)","v":{"$error":"#N/A"}},{"$f":"VLOOKUP(C6,CompositeDescriptorsPerRank!$A$2:$C$122,2,FALSE)","v":{"$error":"#N/A"}}]
[null,"Similarities",null,{"$f":"VLOOKUP(C7,SubtestPerRank!$A$2:$B$20,2,FALSE)","v":{"$error":"#N/A"}},"-"]
[null,"Vocabulary",null,{"$f":"VLOOKUP(C8,SubtestPerRank!$A$2:$B$20,2,FALSE)","v":{"$error":"#N/A"}},"-"]
[null,"Information",null,{"$f":"VLOOKUP(C9,SubtestPerRank!$A$2:$B$20,2,FALSE)","v":{"$error":"#N/A"}},"-"]
[null,"Comprehension",null,{"$f":"VLOOKUP(C10,SubtestPerRank!$A$2:$B$20,2,FALSE)","v":{"$error":"#N/A"}},"-"]
[null,"Visual Spatial Index",null,{"$f":"VLOOKUP(C11,CompositeDescriptorsPerRank!$A$2:$C$122,3,FALSE)","v":{"$error":"#N/A"}},{"$f":"VLOOKUP(C11,CompositeDescriptorsPerRank!$A$2:$C$122,2,FALSE)","v":{"$error":"#N/A"}}]
[null,"Block Design",null,{"$f":"VLOOKUP(C12,SubtestPerRank!$A$2:$B$20,2,FALSE)","v":{"$error":"#N/A"}},"-"]
[null,"Visual Puzzles",null,{"$f":"VLOOKUP(C13,SubtestPerRank!$A$2:$B$20,2,FALSE)","v":{"$error":"#N/A"}},"-"]
[null,"Fluid Reasoning Index",null,{"$f":"VLOOKUP(C14,CompositeDescriptorsPerRank!$A$2:$C$122,3,FALSE)","v":{"$error":"#N/A"}},{"$f":"VLOOKUP(C14,CompositeDescriptorsPerRank!$A$2:$C$122,2,FALSE)","v":{"$error":"#N/A"}}]
[null,"Matrix Reasoning",null,{"$f":"VLOOKUP(C15,SubtestPerRank!$A$2:$B$20,2,FALSE)","v":{"$error":"#N/A"}},"-"]
[null,"Figure Weights",null,{"$f":"VLOOKUP(C16,SubtestPerRank!$A$2:$B$20,2,FALSE)","v":{"$error":"#N/A"}},"-"]
[null,"Picture Concepts",null,{"$f":"VLOOKUP(C17,SubtestPerRank!$A$2:$B$20,2,FALSE)","v":{"$error":"#N/A"}},"-"]
[null,"Arithmetic",null,{"$f":"VLOOKUP(C18,SubtestPerRank!$A$2:$B$20,2,FALSE)","v":{"$error":"#N/A"}},"-"]
[null,"Working Memory Index",null,{"$f":"VLOOKUP(C19,CompositeDescriptorsPerRank!$A$2:$C$122,3,FALSE)","v":{"$error":"#N/A"}},{"$f":"VLOOKUP(C19,CompositeDescriptorsPerRank!$A$2:$C$122,2,FALSE)","v":{"$error":"#N/A"}}]
[null,"Digit Span",null,{"$f":"VLOOKUP(C20,SubtestPerRank!$A$2:$B$20,2,FALSE)","v":{"$error":"#N/A"}},"-"]
[null,"Picture Span",null,{"$f":"VLOOKUP(C21,SubtestPerRank!$A$2:$B$20,2,FALSE)","v":{"$error":"#N/A"}},"-"]
[null,"Letter-Number Sequencing",null,{"$f":"VLOOKUP(C22,SubtestPerRank!$A$2:$B$20,2,FALSE)","v":{"$error":"#N/A"}},"-"]
[null,"Processing Speed Index",null,{"$f":"VLOOKUP(C23,CompositeDescriptorsPerRank!$A$2:$C$122,3,FALSE)","v":{"$error":"#N/A"}},{"$f":"VLOOKUP(C23,CompositeDescriptorsPerRank!$A$2:$C$122,2,FALSE)","v":{"$error":"#N/A"}}]
[null,"Coding",null,{"$f":"VLOOKUP(C24,SubtestPerRank!$A$2:$B$20,2,FALSE)","v":{"$error":"#N/A"}},"-"]
[null,"Symbol Search",null,{"$f":"VLOOKUP(C25,SubtestPerRank!$A$2:$B$20,2,FALSE)","v":{"$error":"#N/A"}},"-"]
[null,"Cancellation",null,{"$f":"VLOOKUP(C26,SubtestPerRank!$A$2:$B$20,2,FALSE)","v":{"$error":"#N/A"}},"-"]
[null,"Naming Speed Index",null,{"$f":"VLOOKUP(C27,CompositeDescriptorsPerRank!$A$2:$C$122,3,FALSE)","v":{"$error":"#N/A"}},{"$f":"VLOOKUP(C27,CompositeDescriptorsPerRank!$A$2:$C$122,2,FALSE)","v":{"$error":"#N/A"}}]
[null,"Naming Speed Literacy",null,{"$f":"VLOOKUP(C28,CompositeDescriptorsPerRank!$A$2:$C$122,3,FALSE)","v":{"$error":"#N/A"}},{"$f":"VLOOKUP(C28,CompositeDescriptorsPerRank!$A$2:$C$122,2,FALSE)","v":{"$error":"#N/A"}}]
[null,"Naming Speed Quantity",null,{"$f":"VLOOKUP(C29,CompositeDescriptorsPerRank!$A$2:$C$122,3,FALSE)","v":{"$error":"#N/A"}},{"$f":"VLOOKUP(C29,CompositeDescriptorsPerRank!$A$2:$C$122,2,FALSE)","v":{"$error":"#N/A"}}]
[null,"Symbol Translation Index",null,{"$f":"VLOOKUP(C30,CompositeDescriptorsPerRank!$A$2:$C$122,3,FALSE)","v":{"$error":"#N/A"}},{"$f":"VLOOKUP(C30,CompositeDescriptorsPerRank!$A$2:$C$122,2,FALSE)","v":{"$error":"#N/A"}}]
[null,"Immediate Symbol Translation",null,{"$f":"VLOOKUP(C31,CompositeDescriptorsPerRank!$A$2:$C$122,3,FALSE)","v":{"$error":"#N/A"}},{"$f":"VLOOKUP(C31,CompositeDescriptorsPerRank!$A$2:$C$122,2,FALSE)","v":{"$error":"#N/A"}}]
[null,"Delayed Symbol Translation",null,{"$f":"VLOOKUP(C32,CompositeDescriptorsPerRank!$A$2:$C$122,3,FALSE)","v":{"$error":"#N/A"}},{"$f":"VLOOKUP(C32,CompositeDescriptorsPerRank!$A$2:$C$122,2,FALSE)","v":{"$error":"#N/A"}}]
[null,"Recognition Symbol Translation",null,{"$f":"VLOOKUP(C33,CompositeDescriptorsPerRank!$A$2:$C$122,3,FALSE)","v":{"$error":"#N/A"}},{"$f":"VLOOKUP(C33,CompositeDescriptorsPerRank!$A$2:$C$122,2,FALSE)","v":{"$error":"#N/A"}}]
[null,"Full Scale IQ",null,{"$f":"VLOOKUP(C34,CompositeDescriptorsPerRank!$A$2:$C$122,3,FALSE)","v":{"$error":"#N/A"}},{"$f":"VLOOKUP(C34,CompositeDescriptorsPerRank!$A$2:$C$122,2,FALSE)","v":{"$error":"#N/A"}}]
[null,"Quantitative Reasoning Index",null,{"$f":"VLOOKUP(C35,CompositeDescriptorsPerRank!$A$2:$C$122,3,FALSE)","v":{"$error":"#N/A"}},{"$f":"VLOOKUP(C35,CompositeDescriptorsPerRank!$A$2:$C$122,2,FALSE)","v":{"$error":"#N/A"}}]
[null,"Auditory Working Memory Index",null,{"$f":"VLOOKUP(C36,CompositeDescriptorsPerRank!$A$2:$C$122,3,FALSE)","v":{"$error":"#N/A"}},{"$f":"VLOOKUP(C36,CompositeDescriptorsPerRank!$A$2:$C$122,2,FALSE)","v":{"$error":"#N/A"}}]
[null,"Nonverbal Index",null,{"$f":"VLOOKUP(C37,CompositeDescriptorsPerRank!$A$2:$C$122,3,FALSE)","v":{"$error":"#N/A"}},{"$f":"VLOOKUP(C37,CompositeDescriptorsPerRank!$A$2:$C$122,2,FALSE)","v":{"$error":"#N/A"}}]
[null,"General Ability Index",null,{"$f":"VLOOKUP(C38,CompositeDescriptorsPerRank!$A$2:$C$122,3,FALSE)","v":{"$error":"#N/A"}},{"$f":"VLOOKUP(C38,CompositeDescriptorsPerRank!$A$2:$C$122,2,FALSE)","v":{"$error":"#N/A"}}]
[null,"Cognitive Proficiency Index",null,{"$f":"VLOOKUP(C39,CompositeDescriptorsPerRank!$A$2:$C$122,3,FALSE)","v":{"$error":"#N/A"}},{"$f":"VLOOKUP(C39,CompositeDescriptorsPerRank!$A$2:$C$122,2,FALSE)","v":{"$error":"#N/A"}}]
[null,"Storage and Retrieval Index",null,{"$f":"VLOOKUP(C40,CompositeDescriptorsPerRank!$A$2:$C$122,3,FALSE)","v":{"$error":"#N/A"}},{"$f":"VLOOKUP(C40,CompositeDescriptorsPerRank!$A$2:$C$122,2,FALSE)","v":{"$error":"#N/A"}}]
[null,"Process Scores"]
[null,"Digit Span Backward",null,{"$f":"VLOOKUP(C42,SubtestPerRank!$A$2:$B$20,2,FALSE)","v":{"$error":"#N/A"}},"-"]
[null,"Digit Span Sequencing",null,{"$f":"VLOOKUP(C43,SubtestPerRank!$A$2:$B$20,2,FALSE)","v":{"$error":"#N/A"}},"-"]
[null,"Additional Process Scores (See Chapter 11)"]
[null,"MR Successive",null,{"$f":"VLOOKUP(C45,SubtestPerRank!$A$2:$B$20,2,FALSE)","v":{"$error":"#N/A"}},"-"]
[null,"MR Simultaneous",null,{"$f":"VLOOKUP(C46,SubtestPerRank!$A$2:$B$20,2,FALSE)","v":{"$error":"#N/A"}},"-"]

{"sheet":"Step2b","index":2,"n_rows":26,"n_cols":22,"rows_kept":26,"cut":false,"hidden":false,"merged":[[0,2,0,12],[1,2,1,12]]}
[null,null,"From Step 2b: Evaluate Pairwise Comparisons with the General Ability Index"]
[null,null,"This step uses the Intelligent Rules of Thumb for pairwise difference comparisons with the General Ability Index"]
[null,null,"Score 1",null,"Score 2",null,"Difference",null,"CalcSum","Count Blank Cells","Significant Difference \n(Y or N)",null,"Base Rate",null,null,null,{"$f":"IF(M11=1,P11,\"\") &IF(M11=0,R12,\"\") &IF(M11=2,R14,\"\")","v":"Not Rare"}]
[null,null,{"$f":"'WISC-V'!C38","v":0},"-",{"$f":"'WISC-V'!C34","v":0},"=",{"$f":"C4-E4","v":0},null,null,null,{"$f":"IF(OR(G4>3,G4<-3),\"Y\",\"N\")","v":"N"},null,{"$f":"IF(OR(G4>6,G4<-6,),\"Rare\",\"Not Rare\")","v":"Not Rare"}]
[null,null,"General Ability Index",null,"Full Scale IQ"]
[null,null,{"$f":"'WISC-V'!C38","v":0},"-",{"$f":"'WISC-V'!C39","v":0},"=",{"$f":"C6-E6","v":0},null,null,null,{"$f":"IF(OR(G6>10,G6<-10),\"Y\",\"N\")","v":"N"},null,{"$f":"Q3","v":"Not Rare"}]
[null,null,"General Ability Index",null,"Cognitive Proficiency Index"]
[null,null,null,null,null,null,null,null,null,null,null,null,null,null,null,null,null,null,null,null,22,"Zoo Locations"]
[null,null,null,null,null,null,null,null,null,null,null,null,null,null,null,null,null,null,null,null,23,"Bug Search"]
[null,null,null,null,null,null,null,null,null,null,null,null,null,null,null,null,null,"VERDICT",null,null,24,"Cancellation"]
[null,null,null,null,null,null,null,null,null,null,null,null,{"$f":"IF(AND(C6>89,C6<110),1,M14)","v":0},null,null,{"$f":"IF(ABS(G6)>16,\"Rare\",\"Not Rare\")","v":"Not Rare"},"average",null,null,null,25,"Animal Coding"]
[null,null,null,null,null,null,null,null,null,null,null,null,null,null,null,{"$f":"IF(G6<-24,\"Rare\",\"Not Rare\")","v":"Not Rare"},"below average, GAI<CPI",{"$f":"IF(G6>0,P13,P12)","v":"Not Rare"},"BELOW AVG"]
[null,null,null,null,null,null,null,null,null,null,null,null,null,null,null,{"$f":"IF($G$6>7,\"Rare\",\"Not Rare\")","v":"Not Rare"},"below average, GAI>CPI"]
[null,null,null,null,null,null,null,null,null,null,null,null,{"$f":"IF(C6<90,0,2)","v":0},null,null,{"$f":"IF($G$6>27,\"Rare\",\"Not Rare\")","v":"Not Rare"},"ABOVE average, GAI>CPI",{"$f":"IF(G6>0,P14,P15)","v":"Not Rare"},"ABOVE AVG"]
[null,null,null,null,null,null,null,null,null,null,null,null,null,null,null,{"$f":"IF($G$6<-7,\"Rare\",\"Not Rare\")","v":"Not Rare"},"ABOVE average, GAI<CPI"]
[]
[]
[null,null,"Index Score Numbers (for Index Pair Codes)",null,null,null,"Select"]
[null,1,"Verbal Comprehension Index",null,null,null,0.01]
[null,2,"Complex Expressive Index",null,null,null,0.05]
[null,3,"Nonverbal Index"]
[null,4,"Comprehensive Verbal Index"]
[null,5,"Gc-K0"]
[null,6,"Gc-VL"]
[null,7,"Gf-Verbal"]
[null,8,"Fluid Reasoning Index"]

{"sheet":"Step3b","index":3,"n_rows":20,"n_cols":20,"rows_kept":20,"cut":false,"hidden":false,"merged":[[0,1,0,19],[1,1,1,19],[2,1,2,19]]}
[null,"Step 3b: Additional Index Scores Sum of Scaled Scores to Composite Score Conversion"]
[null,"•  There are eight possible additional index scores. "]
[null,"•  This program automatically calculates all additional index scores that are available. \n•  See Step 3a of Chapter 8, Select the Index Scores, for more information about use of the additional index scores and location of interpretive information."]
[null,"Additional Index Score","Subtest1",null,"Subtest 2",null,"Subtest 3",null,"Subtest 4",null,"Subtest 5",null,"CalcSum","Count Blank Cells","Sum of \nScaled Scores","Standard Score","Percentile Rank","90%CI","95%CI","Descriptive Category"]
[null,"Verbal (Expanded Crystallized) Index",{"$f":"IF('WISC-V'!C7=\"\",\"\",'WISC-V'!C7)","v":""},"+",{"$f":"IF('WISC-V'!C8=\"\",\"\",'WISC-V'!C8)","v":""},"+",{"$f":"IF('WISC-V'!C9=\"\",\"\",'WISC-V'!C9)","v":""},"+",{"$f":"IF('WISC-V'!C10=\"\",\"\",'WISC-V'!C10)","v":""},null,null,"=",{"$f":"SUM(C5,E5,G5,I5)","v":0},{"$f":"COUNTBLANK(C5:I5)","v":4},{"$f":"IF(N5>0, \"\", M5)","v":""},{"$f":"VLOOKUP($O$5,VECINorm!$A$5:$E$77,2)","v":{"$error":"#N/A"}},{"$f":"VLOOKUP($O$5,VECINorm!$A$5:$E$77,3)","v":{"$error":"#N/A"}},{"$f":"VLOOKUP($O$5,VECINorm!$A$5:$E$77,4)","v":{"$error":"#N/A"}},{"$f":"VLOOKUP($O$5,VECINorm!$A$5:$E$77,5)","v":{"$error":"#N/A"}},{"$f":"VLOOKUP(P5,CompositeDescriptorsPerRank!$A$2:$C$122,2, FALSE)","v":{"$error":"#N/A"}}]
[null,null,"SI ",null,"VC",null,"IN",null,"CO"]
[null,"General Verbal Knowledge (Gc-K0)",{"$f":"IF('WISC-V'!C9=\"\",\"\",'WISC-V'!C9)","v":""},"+",{"$f":"IF('WISC-V'!C10=\"\",\"\",'WISC-V'!C10)","v":""},"+",{"$f":"IF('WISC-V'!C17=\"\",\"\",'WISC-V'!C17)","v":""},null,null,null,null,"=",{"$f":"SUM(C7,E7,G7)","v":0},{"$f":"COUNTBLANK(C7:G7)","v":3},{"$f":"IF(N7>0, \"\", M7)","v":""},{"$f":"VLOOKUP($O$7,GCK0Norm!$A$5:$E$59,2)","v":{"$error":"#N/A"}},{"$f":"VLOOKUP($O$7,GCK0Norm!$A$5:$E$59,3)","v":{"$error":"#N/A"}},{"$f":"VLOOKUP($O$7,GCK0Norm!$A$5:$E$59,4)","v":{"$error":"#N/A"}},{"$f":"VLOOKUP($O$7,GCK0Norm!$A$5:$E$59,5)","v":{"$error":"#N/A"}},{"$f":"VLOOKUP(P7,CompositeDescriptorsPerRank!$A$2:$C$122,2, FALSE)","v":{"$error":"#N/A"}}]
[null,null,"IN",null,"CO ",null,"PC"]
[null,"Expanded Fluid Index",{"$f":"IF('WISC-V'!C15=\"\",\"\",'WISC-V'!C15)","v":""},"+",{"$f":"IF('WISC-V'!C16=\"\",\"\",'WISC-V'!C16)","v":""},"+",{"$f":"IF('WISC-V'!$C17=\"\",\"\",'WISC-V'!$C17)","v":""},"+",{"$f":"IF('WISC-V'!$C18=\"\",\"\",'WISC-V'!$C18)","v":""},null,null,"=",{"$f":"SUM(C9,E9,G9,I9)","v":0},{"$f":"COUNTBLANK(C9:I9)","v":4},{"$f":"IF(N9>0, \"\", M9)","v":""},{"$f":"VLOOKUP($O$9,EFINorm!$A$5:$E$77,2)","v":{"$error":"#N/A"}},{"$f":"VLOOKUP($O$9,EFINorm!$A$5:$E$77,3)","v":{"$error":"#N/A"}},{"$f":"VLOOKUP($O$9,EFINorm!$A$5:$E$77,4)","v":{"$error":"#N/A"}},{"$f":"VLOOKUP($O$9,EFINorm!$A$5:$E$77,5)","v":{"$error":"#N/A"}},{"$f":"VLOOKUP(P9,CompositeDescriptorsPerRank!$A$2:$C$122,2, FALSE)","v":{"$error":"#N/A"}}]
[null,null,"MR",null,"FW",null,"PC",null,"AR"]
[null,"Induction (Gf-I)",{"$f":"IF('WISC-V'!C15=\"\",\"\",'WISC-V'!C15)","v":""},"+",{"$f":"IF('WISC-V'!C17=\"\",\"\",'WISC-V'!C17)","v":""},"+",{"$f":"IF('WISC-V'!$C7=\"\",\"\",'WISC-V'!$C7)","v":""},null,null,null,null,"=",{"$f":"SUM(C11,E11,G11)","v":0},{"$f":"COUNTBLANK(C11:G11)","v":3},{"$f":"IF(N11>0, \"\", M11)","v":""},{"$f":"VLOOKUP($O$11,GfINorm!$A$5:$E$59,2)","v":{"$error":"#N/A"}},{"$f":"VLOOKUP($O$11,GfINorm!$A$5:$E$59,3)","v":{"$error":"#N/A"}},{"$f":"VLOOKUP($O$11,GfINorm!$A$5:$E$59,4)","v":{"$error":"#N/A"}},{"$f":"VLOOKUP($O$11,GfINorm!$A$5:$E$59,5)","v":{"$error":"#N/A"}},{"$f":"VLOOKUP(P11,CompositeDescriptorsPerRank!$A$2:$C$122,2, FALSE)","v":{"$error":"#N/A"}}]
[null,null,"MR",null,"PC",null,"SI"]
[null,"Working Memory Capacity",{"$f":"IF('WISC-V'!C42=\"\",\"\",'WISC-V'!C42)","v":""},"+",{"$f":"IF('WISC-V'!C43=\"\",\"\",'WISC-V'!C43)","v":""},"+",{"$f":"IF('WISC-V'!C22=\"\",\"\",'WISC-V'!C22)","v":""},"+",{"$f":"IF('WISC-V'!$C21=\"\",\"\",'WISC-V'!$C21)","v":""},"+",{"$f":"IF('WISC-V'!$C18=\"\",\"\",'WISC-V'!$C18)","v":""},"=",{"$f":"SUM(C13,E13,G13,I13,K13)","v":0},{"$f":"COUNTBLANK(C13:K13)","v":5},{"$f":"IF(N13>0, \"\", M13)","v":""},{"$f":"VLOOKUP($O$13,WMCNorm!$A$5:$E$95,2)","v":{"$error":"#N/A"}},{"$f":"VLOOKUP($O$13,WMCNorm!$A$5:$E$95,3)","v":{"$error":"#N/A"}},{"$f":"VLOOKUP($O$13,WMCNorm!$A$5:$E$95,4)","v":{"$error":"#N/A"}},{"$f":"VLOOKUP($O$13,WMCNorm!$A$5:$E$95,5)","v":{"$error":"#N/A"}},{"$f":"VLOOKUP(P13,CompositeDescriptorsPerRank!$A$2:$C$122,2, FALSE)","v":{"$error":"#N/A"}}]
[null,null,"DSB",null,"DSS",null,"LN",null,"PS",null,"AR"]
[null,"Perceptual Speed (Gs-P)",{"$f":"IF('WISC-V'!C25=\"\",\"\",'WISC-V'!C25)","v":""},"+",{"$f":"IF('WISC-V'!C26=\"\",\"\",'WISC-V'!C26)","v":""},null,null,null,null,null,null,"=",{"$f":"SUM(C15,E15)","v":0},{"$f":"COUNTBLANK(C15:E15)","v":2},{"$f":"IF(N15>0, \"\", M15)","v":""},{"$f":"VLOOKUP($O$15,GSPNorm!$A$5:$E$41,2)","v":{"$error":"#N/A"}},{"$f":"VLOOKUP($O$15,GSPNorm!$A$5:$E$41,3)","v":{"$error":"#N/A"}},{"$f":"VLOOKUP($O$15,GSPNorm!$A$5:$E$41,4)","v":{"$error":"#N/A"}},{"$f":"VLOOKUP($O$15,GSPNorm!$A$5:$E$41,5)","v":{"$error":"#N/A"}},{"$f":"VLOOKUP(P15,CompositeDescriptorsPerRank!$A$2:$C$122,2, FALSE)","v":{"$error":"#N/A"}}]
[null,null,"SS",null,"CA"]
[null,"Successive Processing Index",{"$f":"IF('WISC-V'!C42=\"\",\"\",'WISC-V'!C42)","v":""},"+",{"$f":"IF('WISC-V'!C43=\"\",\"\",'WISC-V'!C43)","v":""},"+",{"$f":"IF('WISC-V'!C22=\"\",\"\",'WISC-V'!C22)","v":""},"+",{"$f":"IF('WISC-V'!$C45=\"\",\"\",'WISC-V'!$C45)","v":""},null,null,"=",{"$f":"SUM(C17,E17,G17,I17)","v":0},{"$f":"COUNTBLANK(C17:I17)","v":4},{"$f":"IF(N17>0, \"\", M17)","v":""},{"$f":"VLOOKUP($O$17,SUPINorm!$A$5:$E$59,2)","v":{"$error":"#N/A"}},{"$f":"VLOOKUP($O$17,SUPINorm!$A$5:$E$59,3)","v":{"$error":"#N/A"}},{"$f":"VLOOKUP($O$17,SUPINorm!$A$5:$E$59,4)","v":{"$error":"#N/A"}},{"$f":"VLOOKUP($O$17,SUPINorm!$A$5:$E$59,5)","v":{"$error":"#N/A"}},{"$f":"VLOOKUP(P17,CompositeDescriptorsPerRank!$A$2:$C$122,2, FALSE)","v":{"$error":"#N/A"}}]
[null,null,"DSB",null,"DSS",null,"LN",null,"MRSuc"]
[null,"Simultaneous Processing Index",{"$f":"IF('WISC-V'!C8=\"\",\"\",'WISC-V'!C8)","v":""},"+",{"$f":"IF('WISC-V'!C18=\"\",\"\",'WISC-V'!C18)","v":""},"+",{"$f":"IF('WISC-V'!$C46=\"\",\"\",'WISC-V'!$C46)","v":""},null,null,null,null,"=",{"$f":"SUM(C19,E19,G19)","v":0},{"$f":"COUNTBLANK(C19:G19)","v":3},{"$f":"IF(N19>0, \"\", M19)","v":""},{"$f":"VLOOKUP($O$19,SIPINorm!A5:E77,2)","v":{"$error":"#N/A"}},{"$f":"VLOOKUP($O$19,SIPINorm!$A$5:$E$77,3)","v":{"$error":"#N/A"}},{"$f":"VLOOKUP($O$19,SIPINorm!$A$5:$E$77,4)","v":{"$error":"#N/A"}},{"$f":"VLOOKUP($O$19,SIPINorm!$A$5:$E$77,5)","v":{"$error":"#N/A"}},{"$f":"VLOOKUP(P19,CompositeDescriptorsPerRank!$A$2:$C$122,2, FALSE)","v":{"$error":"#N/A"}}]
[null,null,"FW",null,"PC",null,"MRSim"]

{"sheet":"Step5","index":4,"n_rows":14,"n_cols":17,"rows_kept":14,"cut":false,"hidden":false,"merged":[[0,1,0,11],[1,1,1,11]]}
[null,"Step 5: Evaluate Index-Level Strengths and Weaknesses Comparisons"]
[null,"This step uses the Intelligent Rules of Thumb for strengths and weaknesses comparisons for \nthe Full Scale IQ versus the 6 recommended index scores"]
[null,"Index Score Name","Score",null,"FSIQ",null,"Difference",null,"Significant Difference \n(Y or N)","CalcSum","Count Blank Cells","Base Rate"]
[null,"Verbal Comprehension Index (Gc)",{"$f":"IF('WISC-V'!C6=\"\",\"\",'WISC-V'!C6)","v":""},null,{"$f":"'WISC-V'!$C$34","v":0},"=",{"$f":"IF(E4=\"\",\"\",C4-E4)","v":{"$error":"#VALUE!"}},null,{"$f":"IF(OR(G4>9,G4<-9),\"Y\",\"N\")","v":{"$error":"#VALUE!"}},null,null,{"$f":"IF(OR(G4>14,G4<-14),\"Rare\",\"Not Rare\")","v":{"$error":"#VALUE!"}}]
[]
[null,"Visual Spatial Index (Gv)",{"$f":"IF('WISC-V'!C11=\"\",\"\",'WISC-V'!C11)","v":""},null,{"$f":"'WISC-V'!$C$34","v":0},"=",{"$f":"IF(E6=\"\",\"\",C6-E6)","v":{"$error":"#VALUE!"}},null,{"$f":"IF(OR(G6>10,G6<-10),\"Y\",\"N\")","v":{"$error":"#VALUE!"}},null,null,{"$f":"IF(OR(G6>14,G6<-14),\"Rare\",\"Not Rare\")","v":{"$error":"#VALUE!"}}]
[]
[null,"Fluid Reasoning Index (Gf)",{"$f":"IF('WISC-V'!C14=\"\",\"\",'WISC-V'!C14)","v":""},null,{"$f":"'WISC-V'!$C$34","v":0},"=",{"$f":"IF(E8=\"\",\"\",C8-E8)","v":{"$error":"#VALUE!"}},null,{"$f":"IF(OR(G8>9,G8<-9),\"Y\",\"N\")","v":{"$error":"#VALUE!"}},null,null,{"$f":"IF(OR(G8>14,G8<-14),\"Rare\",\"Not Rare\")","v":{"$error":"#VALUE!"}}]
[]
[null,"Working Memory Index (Gsm)",{"$f":"IF('WISC-V'!C19=\"\",\"\",'WISC-V'!C19)","v":""},null,{"$f":"'WISC-V'!$C$34","v":0},"=",{"$f":"IF(E10=\"\",\"\",C10-E10)","v":{"$error":"#VALUE!"}},null,{"$f":"IF(OR(G10>11,G10<-11),\"Y\",\"N\")","v":{"$error":"#VALUE!"}},null,null,{"$f":"IF(OR(G10>20,G10<-20),\"Rare\",\"Not Rare\")","v":{"$error":"#VALUE!"}},null,null,null,null,{"$f":"IF(Intro!C14<8,1,2)","v":1}]
[null,null,null,null,null,null,null,null,null,null,null,null,null,null,null,"younger","older"]
[null,"Processing Speed Index (Gs)",{"$f":"IF('WISC-V'!C23=\"\",\"\",'WISC-V'!C23)","v":""},null,{"$f":"'WISC-V'!$C$34","v":0},"=",{"$f":"IF(E12=\"\",\"\",C12-E12)","v":{"$error":"#VALUE!"}},null,{"$f":"IF(Q10=1,P12,Q12)","v":{"$error":"#VALUE!"}},null,null,{"$f":"IF(OR(G12>20,G12<-20),\"Rare\",\"Not Rare\")","v":{"$error":"#VALUE!"}},null,null,null,{"$f":"IF(OR(G12>11,G12<-11),\"Y\",\"N\")","v":{"$error":"#VALUE!"}},{"$f":"IF(OR(G12>13,G12<-13),\"Y\",\"N\")","v":{"$error":"#VALUE!"}}]
[]
[null,"Symbol Translation Index (Glr)",{"$f":"IF('WISC-V'!C30=\"\",\"\",'WISC-V'!C30)","v":""},null,{"$f":"'WISC-V'!$C$34","v":0},"=",{"$f":"IF(E14=\"\",\"\",C14-E14)","v":{"$error":"#VALUE!"}},null,{"$f":"IF(OR(G14>11,G14<-11),\"Y\",\"N\")","v":{"$error":"#VALUE!"}},null,null,{"$f":"IF(OR(G14>20,G14<-20),\"Rare\",\"Not Rare\")","v":{"$error":"#VALUE!"}}]

{"sheet":"Step6","index":5,"n_rows":22,"n_cols":17,"rows_kept":22,"cut":false,"hidden":false,"merged":[[0,1,0,11],[1,1,1,11]]}
[null,"Step 6: Evaluate Subtest-Level Strengths and Weaknesses Comparisons"]
[null,"This step uses the Intelligent Rules of Thumb for strengths and weaknesses comparisons of the 10 primary subtests with the mean of the 10 primary subtests."]
[null,"Subtest Name","Scaled Score",null,"Mean of the 10 Primary Subtests",null,"Difference",null,"Significant Difference \n(Y or N)","CalcSum","Count Blank Cells","Base Rate"]
[null,"Similarities",{"$f":"'WISC-V'!C7","v":0},null,{"$f":"$Q$4","v":0},"=",{"$f":"C4-E4","v":0},null,{"$f":"IF(OR(G4>3.999,G4<-3.999),\"Y\",\"N\")","v":"N"},null,null,{"$f":"IF(OR(G4>4.999,G4<-4.999),\"Rare\",\"Not Rare\")","v":"Not Rare"},null,null,null,null,{"$f":"AVERAGE(C4,C6,C8,C10,C12,C14,C16,C18,C20,C22)","v":0}]
[]
[null,"Vocabulary",{"$f":"'WISC-V'!C8","v":0},null,{"$f":"$Q$4","v":0},"=",{"$f":"C6-E6","v":0},null,{"$f":"IF(OR(G6>3.999,G6<-3.999),\"Y\",\"N\")","v":"N"},null,null,{"$f":"IF(OR(G6>4.999,G6<-4.999),\"Rare\",\"Not Rare\")","v":"Not Rare"}]
[]
[null,"Block Design",{"$f":"'WISC-V'!C12","v":0},null,{"$f":"$Q$4","v":0},"=",{"$f":"C8-E8","v":0},null,{"$f":"IF(OR(G8>3.999,G8<-3.999),\"Y\",\"N\")","v":"N"},null,null,{"$f":"IF(OR(G8>4.999,G8<-4.999),\"Rare\",\"Not Rare\")","v":"Not Rare"}]
[]
[null,"Visual Puzzles",{"$f":"'WISC-V'!C13","v":0},null,{"$f":"$Q$4","v":0},"=",{"$f":"C10-E10","v":0},null,{"$f":"IF(OR(G10>3.999,G10<-3.999),\"Y\",\"N\")","v":"N"},null,null,{"$f":"IF(OR(G10>4.999,G10<-4.999),\"Rare\",\"Not Rare\")","v":"Not Rare"},null,null,null,null,{"$f":"IF(Intro!C14<8,1,2)","v":1}]
[null,null,null,null,null,null,null,null,null,null,null,null,null,null,null,"younger","older"]
[null,"Matrix Reasoning",{"$f":"'WISC-V'!C15","v":0},null,{"$f":"$Q$4","v":0},"=",{"$f":"C12-E12","v":0},null,{"$f":"IF(OR(G12>3.999,G12<-3.999),\"Y\",\"N\")","v":"N"},null,null,{"$f":"IF(OR(G12>4.999,G12<-4.999),\"Rare\",\"Not Rare\")","v":"Not Rare"}]
[]
[null,"Figure Weights",{"$f":"'WISC-V'!C16","v":0},null,{"$f":"$Q$4","v":0},"=",{"$f":"C14-E14","v":0},null,{"$f":"IF(OR(G14>3.999,G14<-3.999),\"Y\",\"N\")","v":"N"},null,null,{"$f":"IF(OR(G14>4.999,G14<-4.999),\"Rare\",\"Not Rare\")","v":"Not Rare"},null,null,null,null,{"$f":"IF(Intro!C18<8,1,2)","v":1}]
[null,null,null,null,null,null,null,null,null,null,null,null,null,null,null,"younger","older"]
[null,"Digit Span",{"$f":"'WISC-V'!C20","v":0},null,{"$f":"$Q$4","v":0},"=",{"$f":"C16-E16","v":0},null,{"$f":"IF(OR(G16>3.999,G16<-3.999),\"Y\",\"N\")","v":"N"},null,null,{"$f":"IF(OR(G16>4.999,G16<-4.999),\"Rare\",\"Not Rare\")","v":"Not Rare"}]
[]
[null,"Picture Span",{"$f":"'WISC-V'!C21","v":0},null,{"$f":"$Q$4","v":0},"=",{"$f":"C18-E18","v":0},null,{"$f":"IF(OR(G18>3.999,G18<-3.999),\"Y\",\"N\")","v":"N"},null,null,{"$f":"IF(OR(G18>4.999,G18<-4.999),\"Rare\",\"Not Rare\")","v":"Not Rare"},null,null,null,null,{"$f":"IF(Intro!C22<8,1,2)","v":1}]
[null,null,null,null,null,null,null,null,null,null,null,null,null,null,null,"younger","older"]
[null,"Coding",{"$f":"'WISC-V'!C24","v":0},null,{"$f":"$Q$4","v":0},"=",{"$f":"C20-E20","v":0},null,{"$f":"IF(OR(G20>3.999,G20<-3.999),\"Y\",\"N\")","v":"N"},null,null,{"$f":"IF(OR(G20>4.999,G20<-4.999),\"Rare\",\"Not Rare\")","v":"Not Rare"}]
[]
[null,"Symbol Search",{"$f":"'WISC-V'!C25","v":0},null,{"$f":"$Q$4","v":0},"=",{"$f":"C22-E22","v":0},null,{"$f":"IF(OR(G22>3.999,G22<-3.999),\"Y\",\"N\")","v":"N"},null,null,{"$f":"IF(OR(G22>4.999,G22<-4.999),\"Rare\",\"Not Rare\")","v":"Not Rare"},null,null,null,null,{"$f":"IF(Intro!C26<8,1,2)","v":1}]

{"sheet":"Step7","index":6,"n_rows":36,"n_cols":13,"rows_kept":36,"cut":false,"hidden":false,"merged":[[0,2,0,12],[1,2,1,12]]}
[null,null,"From Step 7: Evaluate Index-Level Pairwise Comparisons"]
[null,null,"This step uses the Intelligent Rules of Thumb for pairwise comparisons of the index scores. \nThese pairwise comparisons are described in step 7 of chapter 8, and in chapters 9 and 11."]
[null,null,"Score 1",null,"Score 2",null,"Difference",null,"CalcSum","Count Blank Cells","Significant Difference \n(Y or N)",null,"Base Rate"]
[null,null,{"$f":"IF('WISC-V'!$C6=\"\",\"\",'WISC-V'!$C6)","v":""},"-",{"$f":"IF('WISC-V'!$C14=\"\",\"\",'WISC-V'!$C14)","v":""},"=",{"$f":"C4-E4","v":{"$error":"#VALUE!"}},null,null,null,{"$f":"IF(OR(G4>11,G4<-11),\"Y\",\"N\")","v":{"$error":"#VALUE!"}},null,{"$f":"IF(OR(G4>21,G4<-21),\"Rare\",\"Not Rare\")","v":{"$error":"#VALUE!"}}]
[null,null,"VCI (Gc)",null,"FRI (Gf)"]
[null,null,{"$f":"IF(Step3b!$P5=\"\",\"\",Step3b!$P5)","v":{"$error":"#N/A"}},"-",{"$f":"IF(Step3b!$P9=\"\",\"\",Step3b!$P9)","v":{"$error":"#N/A"}},"=",{"$f":"C6-E6","v":{"$error":"#N/A"}},null,null,null,{"$f":"IF(OR(G6>11,G6<-11),\"Y\",\"N\")","v":{"$error":"#N/A"}},null,{"$f":"IF(OR(G6>21,G6<-21),\"Rare\",\"Not Rare\")","v":{"$error":"#N/A"}}]
[null,null,"Verbal (Expanded Crystallized) Index (Expanded Gc)",null,"Expanded Fluid Index \n(Expanded Gf)"]
[null,null,{"$f":"IF('WISC-V'!$C19=\"\",\"\",'WISC-V'!$C19)","v":""},"-",{"$f":"IF('WISC-V'!$C30=\"\",\"\",'WISC-V'!$C30)","v":""},"=",{"$f":"C8-E8","v":{"$error":"#VALUE!"}},null,null,null,{"$f":"IF(OR(G8>13,G8<-13),\"Y\",\"N\")","v":{"$error":"#VALUE!"}},null,{"$f":"IF(OR(G8>21,G8<-21),\"Rare\",\"Not Rare\")","v":{"$error":"#VALUE!"}}]
[null,null,"WMI (Gsm)",null,"STI (Glr)"]
[null,null,{"$f":"IF(Step3b!$P7=\"\",\"\",Step3b!$P7)","v":{"$error":"#N/A"}},"-",{"$f":"IF('WISC-V'!$C6=\"\",\"\",'WISC-V'!$C6)","v":""},"=",{"$f":"C10-E10","v":{"$error":"#N/A"}},null,null,null,{"$f":"IF(OR(G10>14,G10<-14),\"Y\",\"N\")","v":{"$error":"#N/A"}},null,{"$f":"IF(OR(G10>17,G10<-17),\"Rare\",\"Not Rare\")","v":{"$error":"#N/A"}}]
[null,null,"Gc-K0",null,"VCI (Gc-VL)"]
[null,null,{"$f":"IF(Step3b!$P11=\"\",\"\",Step3b!$P11)","v":{"$error":"#N/A"}},"-",{"$f":"IF('WISC-V'!$C35=\"\",\"\",'WISC-V'!$C35)","v":""},"=",{"$f":"C12-E12","v":{"$error":"#N/A"}},null,null,null,{"$f":"IF(OR(G12>14,G12<-14),\"Y\",\"N\")","v":{"$error":"#N/A"}},null,{"$f":"IF(OR(G12>17,G12<-17),\"Rare\",\"Not Rare\")","v":{"$error":"#N/A"}}]
[null,null,"Gf-I",null,"QRI (Gf-RQ)"]
[null,null,{"$f":"IF('WISC-V'!C45=\"\",\"\",'WISC-V'!C45)","v":""},"-",{"$f":"IF('WISC-V'!C46=\"\",\"\",'WISC-V'!C46)","v":""},"=",{"$f":"C14-E14","v":{"$error":"#VALUE!"}},null,null,null,{"$f":"IF(OR(G14>5,G14<-5),\"Y\",\"N\")","v":{"$error":"#VALUE!"}},null,{"$f":"IF(OR(G14>2,G14<-2),\"Rare\",\"Not Rare\")","v":{"$error":"#VALUE!"}}]
[null,null,"MR Successive",null,"MR Simultaneous"]
[null,null,{"$f":"IF(Step3b!$P17=\"\",\"\",Step3b!$P17)","v":{"$error":"#N/A"}},"-",{"$f":"IF(Step3b!$P19=\"\",\"\",Step3b!$P19)","v":{"$error":"#N/A"}},"=",{"$f":"C16-E16","v":{"$error":"#N/A"}},null,null,null,{"$f":"IF(OR(G16>15,G16<-15),\"Y\",\"N\")","v":{"$error":"#N/A"}},null,{"$f":"IF(OR(G16>17,G16<-17),\"Rare\",\"Not Rare\")","v":{"$error":"#N/A"}}]
[null,null,"Successive Processing Index",null,"Simultaneous Processing Index"]
[]
[]
[]
[]
[]
[]
[]
[]
[]
[]
[null,null,"Index Score Numbers (for Index Pair Codes)",null,null,null,"Select"]
[null,1,"Verbal Comprehension Index",null,null,null,0.01]
[null,2,"Complex Expressive Index",null,null,null,0.05]
[null,3,"Nonverbal Index"]
[null,4,"Comprehensive Verbal Index"]
[null,5,"Gc-K0"]
[null,6,"Gc-VL"]
[null,7,"Gf-Verbal"]
[null,8,"Fluid Reasoning Index"]

{"sheet":"Step8","index":7,"n_rows":4,"n_cols":12,"rows_kept":4,"cut":false,"hidden":false,"merged":[[0,1,0,12],[1,1,1,12]]}
[null,"Step 8: Evaluate Subtest-Level Pairwise Comparison"]
[null,"This step uses the Intelligent Rule of Thumb for pairwise comparison of Symbol Search and Cancellation to assist in interpretation of Gs-P"]
[null,null,null,"Symbol Search",null,"Cancellation",null,"Difference",null,"CalcSum","Count Blank Cells","Base Rate"]
[null,null,null,{"$f":"IF('WISC-V'!C25=\"\",\"\",'WISC-V'!C25)","v":""},"-",{"$f":"IF('WISC-V'!C26=\"\",\"\",'WISC-V'!C26)","v":""},"=",{"$f":"D4-F4","v":{"$error":"#VALUE!"}},null,null,null,{"$f":"IF(OR(H16>4,H4<-4),\"Rare\",\"Not Rare\")","v":{"$error":"#VALUE!"}}]

{"sheet":"SubtestPerRank","index":8,"n_rows":20,"n_cols":2,"rows_kept":20,"cut":false,"hidden":true,"merged":[]}
["Scaled Score","Percentile Rank Equivalent"]
[19,99.9]
[18,99.6]
[17,99]
[16,98]
[15,95]
[14,91]
[13,84]
[12,75]
[11,63]
[10,50]
[9,37]
[8,25]
[7,16]
[6,9]
[5,5]
[4,2]
[3,1]
[2,0.4]
[1,0.1]

{"sheet":"CompositeDescriptorsPerRank","index":9,"n_rows":122,"n_cols":3,"rows_kept":122,"cut":false,"hidden":true,"merged":[]}
["Composite Score Range","Qualitative Descriptor","Percentile Rank"]
[40,"Extremely Low","<0.1"]
[41,"Extremely Low","<0.1"]
[42,"Extremely Low","<0.1"]
[43,"Extremely Low","<0.1"]
[44,"Extremely Low","<0.1"]
[45,"Extremely Low","<0.1"]
[46,"Extremely Low","<0.1"]
[47,"Extremely Low","<0.1"]
[48,"Extremely Low","<0.1"]
[49,"Extremely Low","<0.1"]
[50,"Extremely Low","<0.1"]
[51,"Extremely Low","<0.1"]
[52,"Extremely Low",0.1]
[53,"Extremely Low",0.1]
[54,"Extremely Low",0.1]
[55,"Extremely Low",0.1]
[56,"Extremely Low",0.1]
[57,"Extremely Low",0.1]
[58,"Extremely Low",0.2]
[59,"Extremely Low",0.3]
[60,"Extremely Low",0.4]
[61,"Extremely Low",0.5]
[62,"Extremely Low",1]
[63,"Extremely Low",1]
[64,"Extremely Low",1]
[65,"Extremely Low",1]
[66,"Extremely Low",1]
[67,"Extremely Low",1]
[68,"Extremely Low",2]
[69,"Extremely Low",2]
[70,"Very Low",2]
[71,"Very Low",3]
[72,"Very Low",3]
[73,"Very Low",4]
[74,"Very Low",4]
[75,"Very Low",5]
[76,"Very Low",5]
[77,"Very Low",6]
[78,"Very Low",7]
[79,"Very Low",8]
[80,"Low Average",9]
[81,"Low Average",10]
[82,"Low Average",12]
[83,"Low Average",13]
[84,"Low Average",14]
[85,"Low Average",16]
[86,"Low Average",18]
[87,"Low Average",19]
[88,"Low Average",21]
[89,"Low Average",23]
[90,"Average",25]
[91,"Average",27]
[92,"Average",30]
[93,"Average",32]
[94,"Average",34]
[95,"Average",37]
[96,"Average",40]
[97,"Average",42]
[98,"Average",45]
[99,"Average",47]
[100,"Average",50]
[101,"Average",53]
[102,"Average",55]
[103,"Average",58]
[104,"Average",61]
[105,"Average",63]
[106,"Average",66]
[107,"Average",68]
[108,"Average",70]
[109,"Average",73]
[110,"High Average",75]
[111,"High Average",77]
[112,"High Average",79]
[113,"High Average",81]
[114,"High Average",82]
[115,"High Average",84]
[116,"High Average",86]
[117,"High Average",87]
[118,"High Average",88]
[119,"High Average",90]
[120,"Very High",91]
[121,"Very High",92]
[122,"Very High",93]
[123,"Very High",94]
[124,"Very High",95]
[125,"Very High",95]
[126,"Very High",96]
[127,"Very High",96]
[128,"Very High",97]
[129,"Very High",97]
[130,"Extremely High",98]
[131,"Extremely High",98]
[132,"Extremely High",98]
[133,"Extremely High",99]
[134,"Extremely High",99]
[135,"Extremely High",99]
[136,"Extremely High",99]
[137,"Extremely High",99]
[138,"Extremely High",99]
[139,"Extremely High",99]
[140,"Extremely High",99.5]
[141,"Extremely High",99.6]
[142,"Extremely High",99.7]
[143,"Extremely High",99.7]
[144,"Extremely High",99.8]
[145,"Extremely High",99.8]
[146,"Extremely High",99.9]
[147,"Extremely High",99.9]
[148,"Extremely High",99.9]
[149,"Extremely High",">99.9"]
[150,"Extremely High",">99.9"]
[151,"Extremely High",">99.9"]
[152,"Extremely High",">99.9"]
[153,"Extremely High",">99.9"]
[154,"Extremely High",">99.9"]
[155,"Extremely High",">99.9"]
[156,"Extremely High",">99.9"]
[157,"Extremely High",">99.9"]
[158,"Extremely High",">99.9"]
[159,"Extremely High",">99.9"]
[160,"Extremely High",">99.9"]

{"sheet":"VECINorm","index":10,"n_rows":77,"n_cols":5,"rows_kept":77,"cut":false,"hidden":true,"merged":[[0,0,0,4],[1,1,3,1],[1,3,2,4]]}
["Table A.1 VECI Equivalents of Sums of Scaled Scores"]
["Sum of","VECI","Percentile","Confidence Level"]
["Scaled",null,"Rank"]
["Scores",null,null,0.9,0.95]
[4,45,"<0.1","43-53","42-54"]
[5,47,"<0.1","44-55","43-56"]
[6,49,"<0.1","46-57","45-58"]
[7,50,"<0.1","47-58","46-59"]
[8,52,0.1,"49-60","48-61"]
[9,54,0.1,"51-62","50-63"]
[10,55,0.1,"52-62","51-63"]
[11,57,0.2,"54-64","53-65"]
[12,59,0.3,"56-66","55-67"]
[13,60,0.4,"57-67","56-68"]
[14,62,1,"59-69","58-70"]
[15,63,1,"60-70","59-71"]
[16,64,1,"61-71","60-72"]
[17,66,1,"62-73","61-74"]
[18,68,2,"64-75","63-76"]
[19,70,2,"66-77","65-78"]
[20,71,3,"67-78","66-79"]
[21,73,4,"69-80","68-81"]
[22,74,4,"70-81","69-82"]
[23,75,5,"71-81","70-82"]
[24,77,6,"73-83","72-84"]
[25,78,7,"74-84","73-85"]
[26,79,8,"75-85","74-86"]
[27,80,9,"76-86","75-87"]
[28,82,12,"78-88","77-89"]
[29,83,13,"79-89","78-90"]
[30,85,16,"81-91","80-92"]
[31,87,19,"82-93","81-94"]
[32,88,21,"83-94","82-95"]
[33,89,23,"84-95","83-96"]
[34,91,27,"86-97","85-98"]
[35,93,32,"88-99","87-100"]
[36,95,37,"90-100","89-101"]
[37,96,39,"91-101","90-102"]
[38,98,45,"93-103","92-104"]
[39,99,47,"94-104","93-105"]
[40,100,50,"95-105","94-106"]
[41,102,55,"97-107","96-108"]
[42,103,58,"98-108","97-109"]
[43,105,63,"100-110","99-111"]
[44,106,66,"100-111","99-112"]
[45,107,68,"101-112","100-113"]
[46,108,70,"102-113","101-114"]
[47,110,75,"104-115","103-116"]
[48,111,77,"105-116","104-117"]
[49,113,81,"107-118","106-119"]
[50,114,82,"108-119","107-120"]
[51,116,86,"110-120","109-121"]
[52,118,88,"112-122","111-123"]
[53,119,90,"113-123","112-124"]
[54,120,91,"114-124","113-125"]
[55,122,93,"116-126","115-127"]
[56,124,95,"118-128","117-129"]
[57,125,95,"119-129","118-130"]
[58,127,96,"120-131","119-132"]
[59,128,97,"121-132","120-133"]
[60,130,98,"123-134","122-135"]
[61,131,98,"124-135","123-136"]
[62,133,99,"126-137","125-138"]
[63,134,99,"127-138","126-139"]
[64,136,99,"129-139","128-140"]
[65,137,99,"130-140","129-141"]
[66,138,99,"131-141","130-142"]
[67,140,99.6,"133-143","132-144"]
[68,141,99.7,"134-144","133-145"]
[69,143,99.8,"136-146","135-147"]
[70,144,99.8,"137-147","136-148"]
[71,146,99.9,"138-149","137-150"]
[72,147,99.9,"139-150","138-151"]
[73,149,99.9,"141-152","140-153"]
[74,151,">99.9","143-154","142-155"]
[75,153,">99.9","145-156","144-157"]
[76,155,">99.9","147-157","146-158"]

{"sheet":"GCK0Norm","index":11,"n_rows":59,"n_cols":5,"rows_kept":59,"cut":false,"hidden":true,"merged":[[0,0,0,4],[1,1,3,1],[1,3,2,4]]}
["GCK0 Equivalents of Sums of Scaled Scores"]
["Sum of","Gc-K0","Percentile","Confidence Level"]
["Scaled",null,"Rank"]
["Scores",null,null,0.9,0.95]
[3,45,"<0.1","43-57","42-58"]
[4,47,"<0.1","45-59","44-60"]
[5,49,"<0.1","47-60","46-62"]
[6,51,0.1,"49-62","47-63"]
[7,53,0.1,"50-64","49-65"]
[8,55,0.1,"52-66","51-67"]
[9,57,0.2,"54-68","53-69"]
[10,59,0.3,"56-69","55-71"]
[11,61,0.5,"58-71","56-73"]
[12,63,1,"60-73","58-74"]
[13,65,1,"61-75","60-76"]
[14,67,1,"63-77","62-78"]
[15,69,2,"65-79","64-80"]
[16,71,3,"67-80","66-82"]
[17,73,4,"69-82","67-83"]
[18,75,5,"71-84","69-85"]
[19,77,6,"72-86","71-87"]
[20,79,8,"74-88","73-89"]
[21,81,10,"76-89","75-91"]
[22,83,13,"78-91","77-93"]
[23,85,16,"80-93","78-94"]
[24,87,19,"81-95","80-96"]
[25,89,23,"83-97","82-98"]
[26,91,27,"85-99","84-100"]
[27,93,32,"87-100","86-102"]
[28,95,37,"89-102","87-103"]
[29,98,45,"91-105","90-106"]
[30,100,50,"93-107","92-108"]
[31,102,55,"95-109","94-110"]
[32,104,61,"97-110","96-112"]
[33,106,66,"99-112","97-113"]
[34,108,70,"101-114","99-115"]
[35,111,77,"103-117","102-118"]
[36,113,81,"105-119","104-120"]
[37,115,84,"107-120","106-122"]
[38,117,87,"109-122","107-123"]
[39,119,90,"111-124","109-125"]
[40,122,93,"113-127","112-128"]
[41,124,95,"115-129","114-130"]
[42,126,96,"117-130","116-132"]
[43,128,97,"119-132","117-134"]
[44,130,98,"121-134","119-135"]
[45,132,98,"122-136","121-137"]
[46,134,99,"124-138","123-139"]
[47,136,99,"126-139","125-141"]
[48,137,99,"127-140","126-142"]
[49,139,99.5,"129-142","127-144"]
[50,141,99.7,"131-144","129-145"]
[51,143,99.8,"132-146","131-147"]
[52,145,99.9,"134-148","133-149"]
[53,147,99.9,"136-150","135-151"]
[54,149,99.9,"138-151","137-153"]
[55,151,">99.9","140-153","138-154"]
[56,153,">99.9","141-155","140-156"]
[57,155,">99.9","143-157","142-158"]

{"sheet":"EFINorm","index":12,"n_rows":77,"n_cols":5,"rows_kept":77,"cut":false,"hidden":true,"merged":[[0,0,0,4],[1,1,3,1],[1,3,2,4]]}
["EFI Equivalents of Sums of Scaled Scores"]
["Sum of","EFI","Percentile","Confidence Level"]
["Scaled",null,"Rank"]
["Scores",null,null,0.9,0.95]
[4,45,"<0.1","43-53","42-54"]
[5,46,"<0.1","43-54","42-55"]
[6,48,"<0.1","45-56","44-57"]
[7,49,"<0.1","46-57","45-58"]
[8,51,0.1,"48-59","47-60"]
[9,53,0.1,"50-61","49-62"]
[10,55,0.1,"52-62","51-63"]
[11,57,0.2,"54-64","53-65"]
[12,59,0.3,"56-66","55-67"]
[13,60,0.4,"57-67","56-68"]
[14,62,1,"59-69","58-70"]
[15,63,1,"60-70","59-71"]
[16,64,1,"61-71","60-72"]
[17,66,1,"62-73","61-74"]
[18,67,1,"63-74","62-75"]
[19,69,2,"65-76","64-77"]
[20,70,2,"66-77","65-78"]
[21,71,3,"67-78","66-79"]
[22,72,3,"68-79","67-80"]
[23,73,4,"69-80","68-81"]
[24,74,4,"70-81","69-82"]
[25,75,5,"71-81","70-82"]
[26,77,6,"73-83","72-84"]
[27,78,7,"74-84","73-85"]
[28,79,8,"75-85","74-86"]
[29,81,10,"77-87","76-88"]
[30,82,12,"78-88","77-89"]
[31,84,14,"80-90","79-91"]
[32,86,18,"81-92","80-93"]
[33,87,19,"82-93","81-94"]
[34,89,23,"84-95","83-96"]
[35,91,27,"86-97","85-98"]
[36,93,32,"88-99","87-100"]
[37,94,34,"89-100","88-101"]
[38,96,39,"91-101","90-102"]
[39,98,45,"93-103","92-104"]
[40,100,50,"95-105","94-106"]
[41,102,55,"97-107","96-108"]
[42,104,61,"99-109","98-110"]
[43,105,63,"100-110","99-111"]
[44,107,68,"101-112","100-113"]
[45,109,73,"103-114","102-115"]
[46,110,75,"104-115","103-116"]
[47,112,79,"106-117","105-118"]
[48,114,82,"108-119","107-120"]
[49,116,86,"110-120","109-121"]
[50,117,87,"111-121","110-122"]
[51,119,90,"113-123","112-124"]
[52,120,91,"114-124","113-125"]
[53,122,93,"116-126","115-127"]
[54,124,95,"118-128","117-129"]
[55,126,96,"119-130","118-131"]
[56,127,96,"120-131","119-132"]
[57,128,97,"121-132","120-133"]
[58,130,98,"123-134","122-135"]
[59,132,98,"125-136","124-137"]
[60,133,99,"126-137","125-138"]
[61,135,99,"128-138","127-139"]
[62,136,99,"129-139","128-140"]
[63,138,99,"131-141","130-142"]
[64,140,99.6,"133-143","132-144"]
[65,142,99.7,"135-145","134-146"]
[66,143,99.8,"136-146","135-147"]
[67,144,99.8,"137-147","136-148"]
[68,146,99.9,"138-149","137-150"]
[69,148,99.9,"140-151","139-152"]
[70,150,">99.9","142-153","141-154"]
[71,152,">99.9","144-155","143-156"]
[72,153,">99.9","145-156","144-157"]
[73,154,">99.9","146-157","145-158"]
[74,155,">99.9","147-157","146-158"]
[75,155,">99.9","147-157","146-158"]
[76,155,">99.9","147-157","146-158"]

{"sheet":"GfINorm","index":13,"n_rows":59,"n_cols":5,"rows_kept":59,"cut":false,"hidden":true,"merged":[[0,0,0,4],[1,1,3,1],[1,3,2,4]]}
["GFI Equivalents of Sums of Scaled Scores"]
["Sum of","GFI","Percentile","Confidence Level"]
["Scaled",null,"Rank"]
["Scores",null,null,0.9,0.95]
[3,45,"<0.1","43-56","42-57"]
[4,46,"<0.1","44-57","43-58"]
[5,48,"<0.1","46-59","45-60"]
[6,50,"<0.1","48-60","46-62"]
[7,52,0.1,"49-62","48-63"]
[8,54,0.1,"51-64","50-65"]
[9,56,0.2,"53-66","52-67"]
[10,59,0.3,"56-69","55-70"]
[11,61,0.5,"58-71","56-72"]
[12,63,1,"60-72","58-74"]
[13,65,1,"61-74","60-75"]
[14,67,1,"63-76","62-77"]
[15,69,2,"65-78","64-79"]
[16,71,3,"67-80","66-81"]
[17,73,4,"69-82","68-83"]
[18,75,5,"71-83","69-85"]
[19,77,6,"72-85","71-86"]
[20,79,8,"74-87","73-88"]
[21,80,9,"75-88","74-89"]
[22,82,12,"77-90","76-91"]
[23,84,14,"79-92","78-93"]
[24,86,18,"81-94","79-95"]
[25,89,23,"83-96","82-98"]
[26,91,27,"85-98","84-99"]
[27,93,32,"87-100","86-101"]
[28,96,39,"90-103","89-104"]
[29,98,45,"92-105","91-106"]
[30,100,50,"94-106","92-108"]
[31,102,55,"95-108","94-109"]
[32,104,61,"97-110","96-111"]
[33,107,68,"100-113","99-114"]
[34,109,73,"102-115","101-116"]
[35,111,77,"104-117","102-118"]
[36,113,81,"106-118","104-120"]
[37,115,84,"107-120","106-121"]
[38,118,88,"110-123","109-124"]
[39,120,91,"112-125","111-126"]
[40,122,93,"114-127","113-128"]
[41,124,95,"116-129","114-130"]
[42,126,96,"117-130","116-132"]
[43,128,97,"119-132","118-133"]
[44,130,98,"121-134","120-135"]
[45,131,98,"122-135","121-136"]
[46,133,99,"124-137","123-138"]
[47,135,99,"126-139","125-140"]
[48,137,99,"128-140","126-142"]
[49,139,99.5,"129-142","128-144"]
[50,140,99.6,"130-143","129-144"]
[51,142,99.7,"132-145","131-146"]
[52,144,99.8,"134-147","133-148"]
[53,146,99.9,"136-149","135-150"]
[54,148,99.9,"138-151","137-152"]
[55,150,">99.9","140-152","138-154"]
[56,152,">99.9","141-154","140-155"]
[57,155,">99.9","144-157","143-158"]

{"sheet":"WMCNorm","index":14,"n_rows":95,"n_cols":5,"rows_kept":95,"cut":false,"hidden":true,"merged":[[0,0,0,4],[1,1,3,1],[1,3,2,4]]}
["WMC Equivalents of Sums of Scaled Scores"]
["Sum of","WMC","Percentile","Confidence Level"]
["Scaled",null,"Rank"]
["Scores",null,null,0.9,0.95]
[5,45,"<0.1","43-53","42-54"]
[6,47,"<0.1","44-55","43-56"]
[7,48,"<0.1","45-56","44-57"]
[8,50,"<0.1","47-58","46-59"]
[9,51,0.1,"48-59","47-60"]
[10,52,0.1,"49-60","48-61"]
[11,54,0.1,"51-62","50-63"]
[12,55,0.1,"52-62","51-63"]
[13,56,0.2,"53-63","52-64"]
[14,58,0.3,"55-65","54-66"]
[15,59,0.3,"56-66","55-67"]
[16,60,0.4,"57-67","56-68"]
[17,61,0.5,"58-68","57-69"]
[18,62,1,"59-69","58-70"]
[19,63,1,"60-70","59-71"]
[20,64,1,"61-71","60-72"]
[21,65,1,"62-72","61-73"]
[22,66,1,"62-73","61-74"]
[23,67,1,"63-74","62-75"]
[24,68,2,"64-75","63-76"]
[25,69,2,"65-76","64-77"]
[26,70,2,"66-77","65-78"]
[27,71,3,"67-78","66-79"]
[28,72,3,"68-79","67-80"]
[29,73,4,"69-80","68-81"]
[30,74,4,"70-81","69-82"]
[31,75,5,"71-81","70-82"]
[32,76,5,"72-82","71-83"]
[33,77,6,"73-83","72-84"]
[34,79,8,"75-85","74-86"]
[35,80,9,"76-86","75-87"]
[36,81,10,"77-87","76-88"]
[37,82,12,"78-88","77-89"]
[38,83,13,"79-89","78-90"]
[39,85,16,"81-91","80-92"]
[40,86,18,"81-92","80-93"]
[41,87,19,"82-93","81-94"]
[42,89,23,"84-95","83-96"]
[43,90,25,"85-96","84-97"]
[44,92,30,"87-98","86-99"]
[45,93,32,"88-99","87-100"]
[46,94,34,"89-100","88-101"]
[47,95,37,"90-100","89-101"]
[48,97,42,"92-102","91-103"]
[49,99,47,"94-104","93-105"]
[50,100,50,"95-105","94-106"]
[51,101,53,"96-106","95-107"]
[52,103,58,"98-108","97-109"]
[53,104,61,"99-109","98-110"]
[54,105,63,"100-110","99-111"]
[55,107,68,"101-112","100-113"]
[56,108,70,"102-113","101-114"]
[57,109,73,"103-114","102-115"]
[58,111,77,"105-116","104-117"]
[59,112,79,"106-117","105-118"]
[60,114,82,"108-119","107-120"]
[61,115,84,"109-119","108-120"]
[62,117,87,"111-121","110-122"]
[63,118,88,"112-122","111-123"]
[64,119,90,"113-123","112-124"]
[65,120,91,"114-124","113-125"]
[66,122,93,"116-126","115-127"]
[67,123,94,"117-127","116-128"]
[68,124,95,"118-128","117-129"]
[69,126,96,"119-130","118-131"]
[70,127,96,"120-131","119-132"]
[71,128,97,"121-132","120-133"]
[72,129,97,"122-133","121-134"]
[73,130,98,"123-134","122-135"]
[74,131,98,"124-135","123-136"]
[75,132,98,"125-136","124-137"]
[76,133,99,"126-137","125-138"]
[77,134,99,"127-138","126-139"]
[78,135,99,"128-138","127-139"]
[79,136,99,"129-139","128-140"]
[80,137,99,"130-140","129-141"]
[81,138,99,"131-141","130-142"]
[82,139,99.5,"132-142","131-143"]
[83,140,99.6,"133-143","132-144"]
[84,141,99.7,"134-144","133-145"]
[85,142,99.7,"135-145","134-146"]
[86,143,99.8,"136-146","135-147"]
[87,144,99.8,"137-147","136-148"]
[88,145,99.9,"138-148","137-149"]
[89,147,99.9,"139-150","138-151"]
[90,148,99.9,"140-151","139-152"]
[91,149,99.9,"141-152","140-153"]
[92,150,">99.9","142-153","141-154"]
[93,152,">99.9","144-155","143-156"]
[94,154,">99.9","146-157","145-158"]
[95,155,">99.9","147-157","146-158"]

{"sheet":"GSPNorm","index":15,"n_rows":41,"n_cols":5,"rows_kept":41,"cut":false,"hidden":true,"merged":[[0,0,0,4],[1,1,3,1],[1,3,2,4]]}
["GSP Equivalents of Sums of Scaled Scores"]
["Sum of","GSP","Percentile","Confidence Level"]
["Scaled",null,"Rank"]
["Scores",null,null,0.9,0.95]
[2,45,"<0.1","45-61","43-62"]
[3,49,"<0.1","48-64","47-66"]
[4,53,0.1,"52-68","50-69"]
[5,56,0.2,"54-70","53-72"]
[6,59,0.3,"57-73","55-74"]
[7,62,1,"59-75","58-77"]
[8,65,1,"62-78","60-79"]
[9,67,1,"64-80","62-81"]
[10,70,2,"66-82","65-84"]
[11,73,4,"69-85","67-86"]
[12,76,5,"71-87","70-89"]
[13,79,8,"74-90","72-91"]
[14,81,10,"76-92","74-93"]
[15,84,14,"78-94","77-96"]
[16,87,19,"81-97","79-98"]
[17,91,27,"84-100","83-102"]
[18,94,34,"87-103","85-104"]
[19,97,42,"89-105","88-107"]
[20,100,50,"92-108","91-109"]
[21,103,58,"95-111","93-112"]
[22,106,66,"97-113","96-115"]
[23,109,73,"100-116","98-117"]
[24,112,79,"102-118","101-120"]
[25,115,84,"105-121","103-122"]
[26,118,88,"108-123","106-125"]
[27,122,93,"111-127","109-128"]
[28,125,95,"114-129","112-131"]
[29,128,97,"116-132","115-134"]
[30,131,98,"119-135","117-136"]
[31,134,99,"121-137","120-139"]
[32,137,99,"124-140","122-141"]
[33,140,99.6,"126-142","125-144"]
[34,143,99.8,"129-145","128-146"]
[35,146,99.9,"132-147","130-149"]
[36,149,99.9,"134-150","133-152"]
[37,152,">99.9","137-153","135-154"]
[38,155,">99.9","139-155","138-157"]

{"sheet":"SUPINorm","index":16,"n_rows":59,"n_cols":5,"rows_kept":59,"cut":false,"hidden":true,"merged":[[0,0,0,4],[1,1,3,1],[1,3,2,4]]}
["SUPI Equivalents of Sums of Scaled Scores"]
["Sum of","SUPI","Percentile","Confidence Level"]
["Scaled",null,"Rank"]
["Scores",null,null,0.9,0.95]
[3,45,"<0.1","43-57","42-58"]
[4,48,"<0.1","46-59","45-61"]
[5,50,"<0.1","48-61","46-63"]
[6,53,0.1,"50-64","49-65"]
[7,55,0.1,"52-66","51-67"]
[8,58,0.3,"55-69","54-70"]
[9,60,0.4,"57-70","56-72"]
[10,61,0.5,"58-71","56-73"]
[11,63,1,"60-73","58-74"]
[12,64,1,"61-74","59-75"]
[13,66,1,"62-76","61-77"]
[14,68,2,"64-78","63-79"]
[15,69,2,"65-79","64-80"]
[16,71,3,"67-80","66-82"]
[17,72,3,"68-81","66-83"]
[18,74,4,"70-83","68-84"]
[19,76,5,"71-85","70-86"]
[20,78,7,"73-87","72-88"]
[21,80,9,"75-89","74-90"]
[22,82,12,"77-90","76-92"]
[23,84,14,"79-92","77-93"]
[24,86,18,"81-94","79-95"]
[25,88,21,"82-96","81-97"]
[26,91,27,"85-99","84-100"]
[27,93,32,"87-100","86-102"]
[28,95,37,"89-102","87-103"]
[29,98,45,"91-105","90-106"]
[30,100,50,"93-107","92-108"]
[31,102,55,"95-109","94-110"]
[32,104,61,"97-110","96-112"]
[33,107,68,"100-113","98-114"]
[34,109,73,"101-115","100-116"]
[35,111,77,"103-117","102-118"]
[36,113,81,"105-119","104-120"]
[37,116,86,"108-121","107-123"]
[38,118,88,"110-123","108-124"]
[39,120,91,"111-125","110-126"]
[40,122,93,"113-127","112-128"]
[41,125,95,"116-129","115-131"]
[42,127,96,"118-131","117-133"]
[43,129,97,"120-133","118-134"]
[44,131,98,"121-135","120-136"]
[45,133,99,"123-137","122-138"]
[46,135,99,"125-139","124-140"]
[47,138,99,"128-141","127-143"]
[48,140,99.6,"130-143","128-144"]
[49,142,99.7,"131-145","130-146"]
[50,144,99.8,"133-147","132-148"]
[51,146,99.9,"135-149","134-150"]
[52,148,99.9,"137-150","136-152"]
[53,150,">99.9","139-152","137-154"]
[54,152,">99.9","141-154","139-155"]
[55,154,">99.9","142-156","141-157"]
[56,155,">99.9","143-157","142-158"]
[57,155,">99.9","143-157","142-158"]

{"sheet":"SIPINorm","index":17,"n_rows":77,"n_cols":5,"rows_kept":77,"cut":false,"hidden":true,"merged":[[0,0,0,4],[1,1,3,1],[1,3,2,4]]}
["SIPI Equivalents of Sums of Scaled Scores"]
["Sum of","SIPI","Percentile","Confidence Level"]
["Scaled",null,"Rank"]
["Scores",null,null,0.9,0.95]
[4,45,"<0.1","43-57","42-58"]
[5,46,"<0.1","44-58","43-59"]
[6,48,"<0.1","46-59","45-61"]
[7,50,"<0.1","48-61","46-63"]
[8,51,0.1,"49-62","47-63"]
[9,53,0.1,"50-64","49-65"]
[10,54,0.1,"51-65","50-66"]
[11,56,0.2,"53-67","52-68"]
[12,57,0.2,"54-68","53-69"]
[13,59,0.3,"56-69","55-71"]
[14,60,0.4,"57-70","56-72"]
[15,62,1,"59-72","57-73"]
[16,63,1,"60-73","58-74"]
[17,64,1,"61-74","59-75"]
[18,65,1,"61-75","60-76"]
[19,67,1,"63-77","62-78"]
[20,68,2,"64-78","63-79"]
[21,69,2,"65-79","64-80"]
[22,70,2,"66-79","65-81"]
[23,71,3,"67-80","66-82"]
[24,73,4,"69-82","67-83"]
[25,75,5,"71-84","69-85"]
[26,76,5,"71-85","70-86"]
[27,77,6,"72-86","71-87"]
[28,79,8,"74-88","73-89"]
[29,81,10,"76-89","75-91"]
[30,83,13,"78-91","77-93"]
[31,84,14,"79-92","77-93"]
[32,86,18,"81-94","79-95"]
[33,88,21,"82-96","81-97"]
[34,89,23,"83-97","82-98"]
[35,91,27,"85-99","84-100"]
[36,93,32,"87-100","86-102"]
[37,95,37,"89-102","87-103"]
[38,97,42,"91-104","89-105"]
[39,99,47,"92-106","91-107"]
[40,100,50,"93-107","92-108"]
[41,102,55,"95-109","94-110"]
[42,104,61,"97-110","96-112"]
[43,105,63,"98-111","97-113"]
[44,107,68,"100-113","98-114"]
[45,109,73,"101-115","100-116"]
[46,110,75,"102-116","101-117"]
[47,112,79,"104-118","103-119"]
[48,114,82,"106-119","105-121"]
[49,115,84,"107-120","106-122"]
[50,117,87,"109-122","107-123"]
[51,118,88,"110-123","108-124"]
[52,120,91,"111-125","110-126"]
[53,122,93,"113-127","112-128"]
[54,123,94,"114-128","113-129"]
[55,125,95,"116-129","115-131"]
[56,126,96,"117-130","116-132"]
[57,127,96,"118-131","117-133"]
[58,129,97,"120-133","118-134"]
[59,130,98,"121-134","119-135"]
[60,131,98,"121-135","120-136"]
[61,132,98,"122-136","121-137"]
[62,134,99,"124-138","123-139"]
[63,136,99,"126-139","125-141"]
[64,137,99,"127-140","126-142"]
[65,138,99,"128-141","127-143"]
[66,140,99.6,"130-143","128-144"]
[67,141,99.7,"131-144","129-145"]
[68,143,99.8,"132-146","131-147"]
[69,144,99.8,"133-147","132-148"]
[70,146,99.9,"135-149","134-150"]
[71,147,99.9,"136-150","135-151"]
[72,149,99.9,"138-151","137-153"]
[73,150,">99.9","139-152","137-154"]
[74,152,">99.9","141-154","139-155"]
[75,154,">99.9","142-156","141-157"]
[76,155,">99.9","143-157","142-158"]