{"text_format":"1","workbook":"xlsx","n_sheets":18,"sheets":["Intro","WISC-V","Step2b","Step3b","Step5","Step6","Step7","Step8","SubtestPerRank","CompositeDescriptorsPerRank","VECINorm","GCK0Norm","EFINorm","GfINorm","WMCNorm","GSPNorm","SUPINorm","SIPINorm"],"not_rendered":{"charts":0,"images":0,"macros":1,"external_links":0,"defined_names":0,"comments":0,"pivot_tables":0},"unopened":[],"bounds":{"document_bytes":16777216,"sheet_cells":100000,"rows_first":2000,"rows_last":500,"rows_between":2000,"halvings":0,"cell_chars":16384,"cell_head_chars":4096},"cells_cut":0,"cells_raw":0,"read":"whole","date_system":"1900"}

{"sheet":"Intro","index":0,"n_rows":37,"n_cols":12,"rows_kept":37,"cut":false,"hidden":false,"merged":[[11,2,11,5],[5,1,5,11],[7,7,7,11],[0,1,0,11],[1,1,1,11],[2,1,2,11],[3,1,3,11],[4,1,4,11]]}
[null,"WISC–V© Interpretive Assistant 1.0"]
[null,"Copyright 2016 © by John Wiley & Sons, Inc. All rights reserved.\n*Wechsler Intelligence Scale for Children, Fifth Edition (WISC-V). Copyright © 2014 NCS Pearson, Inc. \n“Wechsler Intelligence Scale for Children” and “WISC” are trademarks, in the US and/or other countries, of Pearson Education, Inc. or its affiliates(s).\n"]
[null,"Programming by Susan Engi Raiford, PhD\nNorms for Additional Scores by Ou Zhang, PhD and Xuechun Zhou, PhD\nNormative data used by permission. All rights reserved.  "]
[null,"This program is based on Intelligent Testing with the WISC–V"]
[null,"By Alan S. Kaufman, Susan Engi Raiford, and Diane L. Coalson"]
[null,"Users of this program are responsible for following the test publisher's administration and scoring guidelines. That is, all scores entered into this program must be derived from the norms and procedures provided by the test publisher."]
[null,"Directions:"]
[null,"•  Clear previously entered data by clicking on the Clear Data button:"]
[null,"•  Enter child's name, test date, and birth date in cells with red borders below."]
[null,"•  Test Age will automatically populate."]
{"$rows_left_out":28}
{"sheet":"WISC-V","index":1,"n_rows":46,"n_cols":5,"rows_kept":46,"cut":false,"hidden":false,"merged":[]}
[null,{"$f":"\"Child's Name: \" &Intro!C12","v":"Child's Name: "},null,null,{"$f":"\"Test Date: \" &Intro!H12 &\"/\" &Intro!J12 &\"/\" & Intro!L12","v":"Test Date: //"}]
[null,{"$f":"\"Test Age: \" &Intro!C14 &\" Years \" &(Intro!E14) &Intro!F14","v":"Test Age: 0 Years 0 Months   OUT OF AGE RANGE!"},null,null,{"$f":"\"Birth Date: \" &Intro!H14 &\"/\" &Intro!J14 &\"/\" &Intro!L14","v":"Birth Date: //"}]
[null,"•  Enter the subtest scaled scores and the composite scores in the white cells."]
[null,"•  The program will automatically calculate the next steps for you."]
[null,"Score","Standard or Scaled Score Value","Percentile \nRank","Descriptive \nCategory"]
[null,"Verbal Comprehension Index",null,{"$f":"VLOOKUP(C6,CompositeDescriptorsPerRank!$A$2:$C$122,3,FALSE)","v":{"$error":"#N/A"}},{"$f":"VLOOKUP(C6,CompositeDescriptorsPerRank!$A$2:$C$122,2,FALSE)","v":{"$error":"#N/A"}}]
[null,"Similarities",null,{"$f":"VLOOKUP(C7,SubtestPerRank!$A$2:$B$20,2,FALSE)","v":{"$error":"#N/A"}},"-"]
[null,"Vocabulary",null,{"$f":"VLOOKUP(C8,SubtestPerRank!$A$2:$B$20,2,FALSE)","v":{"$error":"#N/A"}},"-"]
[null,"Information",null,{"$f":"VLOOKUP(C9,SubtestPerRank!$A$2:$B$20,2,FALSE)","v":{"$error":"#N/A"}},"-"]
[null,"Comprehension",null,{"$f":"VLOOKUP(C10,SubtestPerRank!$A$2:$B$20,2,FALSE)","v":{"$error":"#N/A"}},"-"]
{"$rows_left_out":37}
{"sheet":"Step2b","index":2,"n_rows":26,"n_cols":22,"rows_kept":26,"cut":false,"hidden":false,"merged":[[0,2,0,12],[1,2,1,12]]}
[null,null,"From Step 2b: Evaluate Pairwise Comparisons with the General Ability Index"]
[null,null,"This step uses the Intelligent Rules of Thumb for pairwise difference comparisons with the General Ability Index"]
[null,null,"Score 1",null,"Score 2",null,"Difference",null,"CalcSum","Count Blank Cells","Significant Difference \n(Y or N)",null,"Base Rate",null,null,null,{"$f":"IF(M11=1,P11,\"\") &IF(M11=0,R12,\"\") &IF(M11=2,R14,\"\")","v":"Not Rare"}]
[null,null,{"$f":"'WISC-V'!C38","v":0},"-",{"$f":"'WISC-V'!C34","v":0},"=",{"$f":"C4-E4","v":0},null,null,null,{"$f":"IF(OR(G4>3,G4<-3),\"Y\",\"N\")","v":"N"},null,{"$f":"IF(OR(G4>6,G4<-6,),\"Rare\",\"Not Rare\")","v":"Not Rare"}]
[null,null,"General Ability Index",null,"Full Scale IQ"]
[null,null,{"$f":"'WISC-V'!C38","v":0},"-",{"$f":"'WISC-V'!C39","v":0},"=",{"$f":"C6-E6","v":0},null,null,null,{"$f":"IF(OR(G6>10,G6<-10),\"Y\",\"N\")","v":"N"},null,{"$f":"Q3","v":"Not Rare"}]
[null,null,"General Ability Index",null,"Cognitive Proficiency Index"]
[null,null,null,null,null,null,null,null,null,null,null,null,null,null,null,null,null,null,null,null,22,"Zoo Locations"]
[null,null,null,null,null,null,null,null,null,null,null,null,null,null,null,null,null,null,null,null,23,"Bug Search"]
[null,null,null,null,null,null,null,null,null,null,null,null,null,null,null,null,null,"VERDICT",null,null,24,"Cancellation"]
{"$rows_left_out":17}
{"sheet":"Step3b","index":3,"n_rows":20,"n_cols":20,"rows_kept":20,"cut":false,"hidden":false,"merged":[[0,1,0,19],[1,1,1,19],[2,1,2,19]]}
[null,"Step 3b: Additional Index Scores Sum of Scaled Scores to Composite Score Conversion"]
[null,"•  There are eight possible additional index scores. "]
[null,"•  This program automatically calculates all additional index scores that are available. \n•  See Step 3a of Chapter 8, Select the Index Scores, for more information about use of the additional index scores and location of interpretive information."]
[null,"Additional Index Score","Subtest1",null,"Subtest 2",null,"Subtest 3",null,"Subtest 4",null,"Subtest 5",null,"CalcSum","Count Blank Cells","Sum of \nScaled Scores","Standard Score","Percentile Rank","90%CI","95%CI","Descriptive Category"]
[null,"Verbal (Expanded Crystallized) Index",{"$f":"IF('WISC-V'!C7=\"\",\"\",'WISC-V'!C7)","v":""},"+",{"$f":"IF('WISC-V'!C8=\"\",\"\",'WISC-V'!C8)","v":""},"+",{"$f":"IF('WISC-V'!C9=\"\",\"\",'WISC-V'!C9)","v":""},"+",{"$f":"IF('WISC-V'!C10=\"\",\"\",'WISC-V'!C10)","v":""},null,null,"=",{"$f":"SUM(C5,E5,G5,I5)","v":0},{"$f":"COUNTBLANK(C5:I5)","v":4},{"$f":"IF(N5>0, \"\", M5)","v":""},{"$f":"VLOOKUP($O$5,VECINorm!$A$5:$E$77,2)","v":{"$error":"#N/A"}},{"$f":"VLOOKUP($O$5,VECINorm!$A$5:$E$77,3)","v":{"$error":"#N/A"}},{"$f":"VLOOKUP($O$5,VECINorm!$A$5:$E$77,4)","v":{"$error":"#N/A"}},{"$f":"VLOOKUP($O$5,VECINorm!$A$5:$E$77,5)","v":{"$error":"#N/A"}},{"$f":"VLOOKUP(P5,CompositeDescriptorsPerRank!$A$2:$C$122,2, FALSE)","v":{"$error":"#N/A"}}]
[null,null,"SI ",null,"VC",null,"IN",null,"CO"]
[null,"General Verbal Knowledge (Gc-K0)",{"$f":"IF('WISC-V'!C9=\"\",\"\",'WISC-V'!C9)","v":""},"+",{"$f":"IF('WISC-V'!C10=\"\",\"\",'WISC-V'!C10)","v":""},"+",{"$f":"IF('WISC-V'!C17=\"\",\"\",'WISC-V'!C17)","v":""},null,null,null,null,"=",{"$f":"SUM(C7,E7,G7)","v":0},{"$f":"COUNTBLANK(C7:G7)","v":3},{"$f":"IF(N7>0, \"\", M7)","v":""},{"$f":"VLOOKUP($O$7,GCK0Norm!$A$5:$E$59,2)","v":{"$error":"#N/A"}},{"$f":"VLOOKUP($O$7,GCK0Norm!$A$5:$E$59,3)","v":{"$error":"#N/A"}},{"$f":"VLOOKUP($O$7,GCK0Norm!$A$5:$E$59,4)","v":{"$error":"#N/A"}},{"$f":"VLOOKUP($O$7,GCK0Norm!$A$5:$E$59,5)","v":{"$error":"#N/A"}},{"$f":"VLOOKUP(P7,CompositeDescriptorsPerRank!$A$2:$C$122,2, FALSE)","v":{"$error":"#N/A"}}]
[null,null,"IN",null,"CO ",null,"PC"]
[null,"Expanded Fluid Index",{"$f":"IF('WISC-V'!C15=\"\",\"\",'WISC-V'!C15)","v":""},"+",{"$f":"IF('WISC-V'!C16=\"\",\"\",'WISC-V'!C16)","v":""},"+",{"$f":"IF('WISC-V'!$C17=\"\",\"\",'WISC-V'!$C17)","v":""},"+",{"$f":"IF('WISC-V'!$C18=\"\",\"\",'WISC-V'!$C18)","v":""},null,null,"=",{"$f":"SUM(C9,E9,G9,I9)","v":0},{"$f":"COUNTBLANK(C9:I9)","v":4},{"$f":"IF(N9>0, \"\", M9)","v":""},{"$f":"VLOOKUP($O$9,EFINorm!$A$5:$E$77,2)","v":{"$error":"#N/A"}},{"$f":"VLOOKUP($O$9,EFINorm!$A$5:$E$77,3)","v":{"$error":"#N/A"}},{"$f":"VLOOKUP($O$9,EFINorm!$A$5:$E$77,4)","v":{"$error":"#N/A"}},{"$f":"VLOOKUP($O$9,EFINorm!$A$5:$E$77,5)","v":{"$error":"#N/A"}},{"$f":"VLOOKUP(P9,CompositeDescriptorsPerRank!$A$2:$C$122,2, FALSE)","v":{"$error":"#N/A"}}]
[null,null,"MR",null,"FW",null,"PC",null,"AR"]
{"$rows_left_out":11}
{"sheet":"Step5","index":4,"n_rows":14,"n_cols":17,"rows_kept":14,"cut":false,"hidden":false,"merged":[[0,1,0,11],[1,1,1,11]]}
[null,"Step 5: Evaluate Index-Level Strengths and Weaknesses Comparisons"]
[null,"This step uses the Intelligent Rules of Thumb for strengths and weaknesses comparisons for \nthe Full Scale IQ versus the 6 recommended index scores"]
[null,"Index Score Name","Score",null,"FSIQ",null,"Difference",null,"Significant Difference \n(Y or N)","CalcSum","Count Blank Cells","Base Rate"]
[null,"Verbal Comprehension Index (Gc)",{"$f":"IF('WISC-V'!C6=\"\",\"\",'WISC-V'!C6)","v":""},null,{"$f":"'WISC-V'!$C$34","v":0},"=",{"$f":"IF(E4=\"\",\"\",C4-E4)","v":{"$error":"#VALUE!"}},null,{"$f":"IF(OR(G4>9,G4<-9),\"Y\",\"N\")","v":{"$error":"#VALUE!"}},null,null,{"$f":"IF(OR(G4>14,G4<-14),\"Rare\",\"Not Rare\")","v":{"$error":"#VALUE!"}}]
[]
[null,"Visual Spatial Index (Gv)",{"$f":"IF('WISC-V'!C11=\"\",\"\",'WISC-V'!C11)","v":""},null,{"$f":"'WISC-V'!$C$34","v":0},"=",{"$f":"IF(E6=\"\",\"\",C6-E6)","v":{"$error":"#VALUE!"}},null,{"$f":"IF(OR(G6>10,G6<-10),\"Y\",\"N\")","v":{"$error":"#VALUE!"}},null,null,{"$f":"IF(OR(G6>14,G6<-14),\"Rare\",\"Not Rare\")","v":{"$error":"#VALUE!"}}]
[]
[null,"Fluid Reasoning Index (Gf)",{"$f":"IF('WISC-V'!C14=\"\",\"\",'WISC-V'!C14)","v":""},null,{"$f":"'WISC-V'!$C$34","v":0},"=",{"$f":"IF(E8=\"\",\"\",C8-E8)","v":{"$error":"#VALUE!"}},null,{"$f":"IF(OR(G8>9,G8<-9),\"Y\",\"N\")","v":{"$error":"#VALUE!"}},null,null,{"$f":"IF(OR(G8>14,G8<-14),\"Rare\",\"Not Rare\")","v":{"$error":"#VALUE!"}}]
[]
[null,"Working Memory Index (Gsm)",{"$f":"IF('WISC-V'!C19=\"\",\"\",'WISC-V'!C19)","v":""},null,{"$f":"'WISC-V'!$C$34","v":0},"=",{"$f":"IF(E10=\"\",\"\",C10-E10)","v":{"$error":"#VALUE!"}},null,{"$f":"IF(OR(G10>11,G10<-11),\"Y\",\"N\")","v":{"$error":"#VALUE!"}},null,null,{"$f":"IF(OR(G10>20,G10<-20),\"Rare\",\"Not Rare\")","v":{"$error":"#VALUE!"}},null,null,null,null,{"$f":"IF(Intro!C14<8,1,2)","v":1}]
{"$rows_left_out":5}
{"sheet":"Step6","index":5,"n_rows":22,"n_cols":17,"rows_kept":22,"cut":false,"hidden":false,"merged":[[0,1,0,11],[1,1,1,11]]}
[null,"Step 6: Evaluate Subtest-Level Strengths and Weaknesses Comparisons"]
[null,"This step uses the Intelligent Rules of Thumb for strengths and weaknesses comparisons of the 10 primary subtests with the mean of the 10 primary subtests."]
[null,"Subtest Name","Scaled Score",null,"Mean of the 10 Primary Subtests",null,"Difference",null,"Significant Difference \n(Y or N)","CalcSum","Count Blank Cells","Base Rate"]
[null,"Similarities",{"$f":"'WISC-V'!C7","v":0},null,{"$f":"$Q$4","v":0},"=",{"$f":"C4-E4","v":0},null,{"$f":"IF(OR(G4>3.999,G4<-3.999),\"Y\",\"N\")","v":"N"},null,null,{"$f":"IF(OR(G4>4.999,G4<-4.999),\"Rare\",\"Not Rare\")","v":"Not Rare"},null,null,null,null,{"$f":"AVERAGE(C4,C6,C8,C10,C12,C14,C16,C18,C20,C22)","v":0}]
[]
[null,"Vocabulary",{"$f":"'WISC-V'!C8","v":0},null,{"$f":"$Q$4","v":0},"=",{"$f":"C6-E6","v":0},null,{"$f":"IF(OR(G6>3.999,G6<-3.999),\"Y\",\"N\")","v":"N"},null,null,{"$f":"IF(OR(G6>4.999,G6<-4.999),\"Rare\",\"Not Rare\")","v":"Not Rare"}]
[]
[null,"Block Design",{"$f":"'WISC-V'!C12","v":0},null,{"$f":"$Q$4","v":0},"=",{"$f":"C8-E8","v":0},null,{"$f":"IF(OR(G8>3.999,G8<-3.999),\"Y\",\"N\")","v":"N"},null,null,{"$f":"IF(OR(G8>4.999,G8<-4.999),\"Rare\",\"Not Rare\")","v":"Not Rare"}]
[]
[null,"Visual Puzzles",{"$f":"'WISC-V'!C13","v":0},null,{"$f":"$Q$4","v":0},"=",{"$f":"C10-E10","v":0},null,{"$f":"IF(OR(G10>3.999,G10<-3.999),\"Y\",\"N\")","v":"N"},null,null,{"$f":"IF(OR(G10>4.999,G10<-4.999),\"Rare\",\"Not Rare\")","v":"Not Rare"},null,null,null,null,{"$f":"IF(Intro!C14<8,1,2)","v":1}]
{"$rows_left_out":13}
{"sheet":"Step7","index":6,"n_rows":36,"n_cols":13,"rows_kept":36,"cut":false,"hidden":false,"merged":[[0,2,0,12],[1,2,1,12]]}
[null,null,"From Step 7: Evaluate Index-Level Pairwise Comparisons"]
[null,null,"This step uses the Intelligent Rules of Thumb for pairwise comparisons of the index scores. \nThese pairwise comparisons are described in step 7 of chapter 8, and in chapters 9 and 11."]
[null,null,"Score 1",null,"Score 2",null,"Difference",null,"CalcSum","Count Blank Cells","Significant Difference \n(Y or N)",null,"Base Rate"]
[null,null,{"$f":"IF('WISC-V'!$C6=\"\",\"\",'WISC-V'!$C6)","v":""},"-",{"$f":"IF('WISC-V'!$C14=\"\",\"\",'WISC-V'!$C14)","v":""},"=",{"$f":"C4-E4","v":{"$error":"#VALUE!"}},null,null,null,{"$f":"IF(OR(G4>11,G4<-11),\"Y\",\"N\")","v":{"$error":"#VALUE!"}},null,{"$f":"IF(OR(G4>21,G4<-21),\"Rare\",\"Not Rare\")","v":{"$error":"#VALUE!"}}]
[null,null,"VCI (Gc)",null,"FRI (Gf)"]
[null,null,{"$f":"IF(Step3b!$P5=\"\",\"\",Step3b!$P5)","v":{"$error":"#N/A"}},"-",{"$f":"IF(Step3b!$P9=\"\",\"\",Step3b!$P9)","v":{"$error":"#N/A"}},"=",{"$f":"C6-E6","v":{"$error":"#N/A"}},null,null,null,{"$f":"IF(OR(G6>11,G6<-11),\"Y\",\"N\")","v":{"$error":"#N/A"}},null,{"$f":"IF(OR(G6>21,G6<-21),\"Rare\",\"Not Rare\")","v":{"$error":"#N/A"}}]
[null,null,"Verbal (Expanded Crystallized) Index (Expanded Gc)",null,"Expanded Fluid Index \n(Expanded Gf)"]
[null,null,{"$f":"IF('WISC-V'!$C19=\"\",\"\",'WISC-V'!$C19)","v":""},"-",{"$f":"IF('WISC-V'!$C30=\"\",\"\",'WISC-V'!$C30)","v":""},"=",{"$f":"C8-E8","v":{"$error":"#VALUE!"}},null,null,null,{"$f":"IF(OR(G8>13,G8<-13),\"Y\",\"N\")","v":{"$error":"#VALUE!"}},null,{"$f":"IF(OR(G8>21,G8<-21),\"Rare\",\"Not Rare\")","v":{"$error":"#VALUE!"}}]
[null,null,"WMI (Gsm)",null,"STI (Glr)"]
[null,null,{"$f":"IF(Step3b!$P7=\"\",\"\",Step3b!$P7)","v":{"$error":"#N/A"}},"-",{"$f":"IF('WISC-V'!$C6=\"\",\"\",'WISC-V'!$C6)","v":""},"=",{"$f":"C10-E10","v":{"$error":"#N/A"}},null,null,null,{"$f":"IF(OR(G10>14,G10<-14),\"Y\",\"N\")","v":{"$error":"#N/A"}},null,{"$f":"IF(OR(G10>17,G10<-17),\"Rare\",\"Not Rare\")","v":{"$error":"#N/A"}}]
{"$rows_left_out":27}
{"sheet":"Step8","index":7,"n_rows":4,"n_cols":12,"rows_kept":4,"cut":false,"hidden":false,"merged":[[0,1,0,12],[1,1,1,12]]}
[null,"Step 8: Evaluate Subtest-Level Pairwise Comparison"]
[null,"This step uses the Intelligent Rule of Thumb for pairwise comparison of Symbol Search and Cancellation to assist in interpretation of Gs-P"]
[null,null,null,"Symbol Search",null,"Cancellation",null,"Difference",null,"CalcSum","Count Blank Cells","Base Rate"]
[null,null,null,{"$f":"IF('WISC-V'!C25=\"\",\"\",'WISC-V'!C25)","v":""},"-",{"$f":"IF('WISC-V'!C26=\"\",\"\",'WISC-V'!C26)","v":""},"=",{"$f":"D4-F4","v":{"$error":"#VALUE!"}},null,null,null,{"$f":"IF(OR(H16>4,H4<-4),\"Rare\",\"Not Rare\")","v":{"$error":"#VALUE!"}}]

{"sheet":"SubtestPerRank","index":8,"n_rows":20,"n_cols":2,"rows_kept":20,"cut":false,"hidden":true,"merged":[]}
["Scaled Score","Percentile Rank Equivalent"]
[19,99.9]
[18,99.6]
[17,99]
[16,98]
[15,95]
[14,91]
[13,84]
[12,75]
[11,63]
{"$rows_left_out":11}
{"sheet":"CompositeDescriptorsPerRank","index":9,"n_rows":122,"n_cols":3,"rows_kept":122,"cut":false,"hidden":true,"merged":[]}
["Composite Score Range","Qualitative Descriptor","Percentile Rank"]
[40,"Extremely Low","<0.1"]
[41,"Extremely Low","<0.1"]
[42,"Extremely Low","<0.1"]
[43,"Extremely Low","<0.1"]
[44,"Extremely Low","<0.1"]
[45,"Extremely Low","<0.1"]
[46,"Extremely Low","<0.1"]
[47,"Extremely Low","<0.1"]
[48,"Extremely Low","<0.1"]
{"$rows_left_out":113}
{"sheet":"VECINorm","index":10,"n_rows":77,"n_cols":5,"rows_kept":77,"cut":false,"hidden":true,"merged":[[0,0,0,4],[1,1,3,1],[1,3,2,4]]}
["Table A.1 VECI Equivalents of Sums of Scaled Scores"]
["Sum of","VECI","Percentile","Confidence Level"]
["Scaled",null,"Rank"]
["Scores",null,null,0.9,0.95]
[4,45,"<0.1","43-53","42-54"]
[5,47,"<0.1","44-55","43-56"]
[6,49,"<0.1","46-57","45-58"]
[7,50,"<0.1","47-58","46-59"]
[8,52,0.1,"49-60","48-61"]
[9,54,0.1,"51-62","50-63"]
{"$rows_left_out":68}
{"sheet":"GCK0Norm","index":11,"n_rows":59,"n_cols":5,"rows_kept":59,"cut":false,"hidden":true,"merged":[[0,0,0,4],[1,1,3,1],[1,3,2,4]]}
["GCK0 Equivalents of Sums of Scaled Scores"]
["Sum of","Gc-K0","Percentile","Confidence Level"]
["Scaled",null,"Rank"]
["Scores",null,null,0.9,0.95]
[3,45,"<0.1","43-57","42-58"]
[4,47,"<0.1","45-59","44-60"]
[5,49,"<0.1","47-60","46-62"]
[6,51,0.1,"49-62","47-63"]
[7,53,0.1,"50-64","49-65"]
[8,55,0.1,"52-66","51-67"]
{"$rows_left_out":50}
{"sheet":"EFINorm","index":12,"n_rows":77,"n_cols":5,"rows_kept":77,"cut":false,"hidden":true,"merged":[[0,0,0,4],[1,1,3,1],[1,3,2,4]]}
["EFI Equivalents of Sums of Scaled Scores"]
["Sum of","EFI","Percentile","Confidence Level"]
["Scaled",null,"Rank"]
["Scores",null,null,0.9,0.95]
[4,45,"<0.1","43-53","42-54"]
[5,46,"<0.1","43-54","42-55"]
[6,48,"<0.1","45-56","44-57"]
[7,49,"<0.1","46-57","45-58"]
[8,51,0.1,"48-59","47-60"]
[9,53,0.1,"50-61","49-62"]
{"$rows_left_out":68}
{"sheet":"GfINorm","index":13,"n_rows":59,"n_cols":5,"rows_kept":59,"cut":false,"hidden":true,"merged":[[0,0,0,4],[1,1,3,1],[1,3,2,4]]}
["GFI Equivalents of Sums of Scaled Scores"]
["Sum of","GFI","Percentile","Confidence Level"]
["Scaled",null,"Rank"]
["Scores",null,null,0.9,0.95]
[3,45,"<0.1","43-56","42-57"]
[4,46,"<0.1","44-57","43-58"]
[5,48,"<0.1","46-59","45-60"]
[6,50,"<0.1","48-60","46-62"]
[7,52,0.1,"49-62","48-63"]
[8,54,0.1,"51-64","50-65"]
{"$rows_left_out":50}
{"sheet":"WMCNorm","index":14,"n_rows":95,"n_cols":5,"rows_kept":95,"cut":false,"hidden":true,"merged":[[0,0,0,4],[1,1,3,1],[1,3,2,4]]}
["WMC Equivalents of Sums of Scaled Scores"]
["Sum of","WMC","Percentile","Confidence Level"]
["Scaled",null,"Rank"]
["Scores",null,null,0.9,0.95]
[5,45,"<0.1","43-53","42-54"]
[6,47,"<0.1","44-55","43-56"]
[7,48,"<0.1","45-56","44-57"]
[8,50,"<0.1","47-58","46-59"]
[9,51,0.1,"48-59","47-60"]
[10,52,0.1,"49-60","48-61"]
{"$rows_left_out":86}
{"sheet":"GSPNorm","index":15,"n_rows":41,"n_cols":5,"rows_kept":41,"cut":false,"hidden":true,"merged":[[0,0,0,4],[1,1,3,1],[1,3,2,4]]}
["GSP Equivalents of Sums of Scaled Scores"]
["Sum of","GSP","Percentile","Confidence Level"]
["Scaled",null,"Rank"]
["Scores",null,null,0.9,0.95]
[2,45,"<0.1","45-61","43-62"]
[3,49,"<0.1","48-64","47-66"]
[4,53,0.1,"52-68","50-69"]
[5,56,0.2,"54-70","53-72"]
[6,59,0.3,"57-73","55-74"]
[7,62,1,"59-75","58-77"]
{"$rows_left_out":32}
{"sheet":"SUPINorm","index":16,"n_rows":59,"n_cols":5,"rows_kept":59,"cut":false,"hidden":true,"merged":[[0,0,0,4],[1,1,3,1],[1,3,2,4]]}
["SUPI Equivalents of Sums of Scaled Scores"]
["Sum of","SUPI","Percentile","Confidence Level"]
["Scaled",null,"Rank"]
["Scores",null,null,0.9,0.95]
[3,45,"<0.1","43-57","42-58"]
[4,48,"<0.1","46-59","45-61"]
[5,50,"<0.1","48-61","46-63"]
[6,53,0.1,"50-64","49-65"]
[7,55,0.1,"52-66","51-67"]
[8,58,0.3,"55-69","54-70"]
{"$rows_left_out":50}
{"sheet":"SIPINorm","index":17,"n_rows":77,"n_cols":5,"rows_kept":77,"cut":false,"hidden":true,"merged":[[0,0,0,4],[1,1,3,1],[1,3,2,4]]}
["SIPI Equivalents of Sums of Scaled Scores"]
["Sum of","SIPI","Percentile","Confidence Level"]
["Scaled",null,"Rank"]
["Scores",null,null,0.9,0.95]
[4,45,"<0.1","43-57","42-58"]
[5,46,"<0.1","44-58","43-59"]
[6,48,"<0.1","46-59","45-61"]
[7,50,"<0.1","48-61","46-63"]
[8,51,0.1,"49-62","47-63"]
[9,53,0.1,"50-64","49-65"]
{"$rows_left_out":67}